Build failed in Jenkins: Torque4-trunk #575

classic Classic list List threaded Threaded
21 messages Options
12
Reply | Threaded
Open this post in threaded view
|

Build failed in Jenkins: Torque4-trunk #575

Apache Jenkins Server-2
See <https://builds.apache.org/job/Torque4-trunk/575/display/redirect>

------------------------------------------
[...truncated 161.02 KB...]
A         torque-runtime/src/test/java/org/apache/torque/adapter
AU        torque-runtime/src/test/java/org/apache/torque/adapter/DBOracleTest.java
A         torque-runtime/src/test/java/org/apache/torque/avalon
AU        torque-runtime/src/test/java/org/apache/torque/avalon/AvalonTest.java
AU        torque-runtime/src/test/java/org/apache/torque/TorqueRuntimeExceptionTest.java
A         torque-runtime/src/test/java/org/apache/torque/criteria
AU        torque-runtime/src/test/java/org/apache/torque/criteria/CriterionTest.java
AU        torque-runtime/src/test/java/org/apache/torque/criteria/JoinTest.java
AU        torque-runtime/src/test/java/org/apache/torque/criteria/CriteriaTest.java
AU        torque-runtime/src/test/java/org/apache/torque/TorqueInstanceTest.java
AU        torque-runtime/src/test/java/org/apache/torque/BaseTestCase.java
A         torque-runtime/src/test/java/org/apache/torque/manager
AU        torque-runtime/src/test/java/org/apache/torque/manager/AbstractBaseManagerTest.java
AU        torque-runtime/src/test/java/org/apache/torque/manager/TestManager.java
AU        torque-runtime/src/test/java/org/apache/torque/manager/TestPersistent.java
AU        torque-runtime/src/test/java/org/apache/torque/manager/MethodResultCacheTest.java
A         torque-runtime/src/test/java/org/apache/torque/om
AU        torque-runtime/src/test/java/org/apache/torque/om/NumberKeyTest.java
A         torque-runtime/src/test/java/org/apache/torque/om/mapper
AU        torque-runtime/src/test/java/org/apache/torque/om/mapper/CompositeMapperTest.java
AU        torque-runtime/src/test/java/org/apache/torque/om/mapper/ObjectListMapperTest.java
AU        torque-runtime/src/test/java/org/apache/torque/om/mapper/StringMapperTest.java
AU        torque-runtime/src/test/java/org/apache/torque/om/mapper/DateMapperTest.java
AU        torque-runtime/src/test/java/org/apache/torque/om/mapper/IntegerMapperTest.java
AU        torque-runtime/src/test/java/org/apache/torque/om/mapper/LongMapperTest.java
AU        torque-runtime/src/test/java/org/apache/torque/om/mapper/BigDecimalMapperTest.java
AU        torque-runtime/src/test/java/org/apache/torque/om/ComboKeyTest.java
A         torque-runtime/src/test/java/org/apache/torque/map
AU        torque-runtime/src/test/java/org/apache/torque/map/ColumnMapTest.java
A         torque-runtime/src/test/java/org/apache/torque/util
A         torque-runtime/src/test/java/org/apache/torque/util/SummaryHelperTest.java
AU        torque-runtime/src/test/java/org/apache/torque/util/UniqueListTest.java
AU        torque-runtime/src/test/java/org/apache/torque/util/BasePeerImplTest.java
A         torque-runtime/src/test/java/org/apache/torque/util/functions
AU        torque-runtime/src/test/java/org/apache/torque/util/functions/MaxTest.java
AU        torque-runtime/src/test/java/org/apache/torque/util/functions/CountTest.java
AU        torque-runtime/src/test/java/org/apache/torque/util/functions/AbstractFunctionTest.java
AU        torque-runtime/src/test/java/org/apache/torque/util/functions/AggregateFunctionTest.java
AU        torque-runtime/src/test/java/org/apache/torque/util/functions/AvgTest.java
AU        torque-runtime/src/test/java/org/apache/torque/util/functions/MinTest.java
AU        torque-runtime/src/test/java/org/apache/torque/util/functions/SumTest.java
A         torque-runtime/pom.xml
A         torque-runtime/LICENSE.txt
A         torque-runtime/NOTICE
A         NOTICE
A         torque-site
A         torque-site/NOTICE
A         torque-site/src
A         torque-site/src/changes
AU        torque-site/src/changes/old-changes.xml
A         torque-site/src/dtd
A         torque-site/src/dtd/database.dtd
A         torque-site/src/dtd/database_3_0_0.dtd
A         torque-site/src/dtd/database_3_0_1.dtd
A         torque-site/src/dtd/database_3_1.dtd
A         torque-site/src/dtd/database_3_2.dtd
A         torque-site/src/gimp
AU        torque-site/src/gimp/torque-logo-new.xcf.gz
A         torque-site/src/ant
A         torque-site/src/ant/build.xml
A         torque-site/src/site
AU        torque-site/src/site/site.xml
A         torque-site/src/site/resources
A         torque-site/src/site/resources/tools
AU        torque-site/src/site/resources/tools/D4-Torque.xslt
AU        torque-site/src/site/resources/tools/schema2erd.xsl
A         torque-site/src/site/resources/images
AU        torque-site/src/site/resources/images/db-logo-white.png
AU        torque-site/src/site/resources/images/schema-database.png
AU        torque-site/src/site/resources/images/torque-logo-new.png
AU        torque-site/src/site/resources/images/schema-table.png
AU        torque-site/src/site/resources/images/schema-view.png
AU        torque-site/src/site/resources/images/generated-classes.png
A         torque-site/src/site/xslt
A         torque-site/src/site/xslt/body-content.xsl
A         torque-site/src/site/xdoc
AU        torque-site/src/site/xdoc/download.xml
AU        torque-site/src/site/xdoc/index.xml
A         torque-site/src/site/xdoc/addons.xml
A         torque-site/src/site/xdoc/documentation
A         torque-site/src/site/xdoc/documentation/modules
A         torque-site/src/site/xdoc/documentation/modules/templates
A         torque-site/src/site/xdoc/documentation/modules/templates/reports
A         torque-site/src/site/xdoc/documentation/modules/templates/reports/index.xml
A         torque-site/src/site/xdoc/documentation/modules/templates/reports/taglist.xml
A         torque-site/src/site/xdoc/documentation/modules/templates/reports/jdepend-report.xml
A         torque-site/src/site/xdoc/documentation/modules/templates/dependencies.xml
A         torque-site/src/site/xdoc/documentation/modules/templates/index.xml
A         torque-site/src/site/xdoc/documentation/modules/maven-plugin
A         torque-site/src/site/xdoc/documentation/modules/maven-plugin/reference
A         torque-site/src/site/xdoc/documentation/modules/maven-plugin/reference/generate-goal.xml
A         torque-site/src/site/xdoc/documentation/modules/maven-plugin/reference/index.xml
A         torque-site/src/site/xdoc/documentation/modules/maven-plugin/reports
A         torque-site/src/site/xdoc/documentation/modules/maven-plugin/reports/index.xml
A         torque-site/src/site/xdoc/documentation/modules/maven-plugin/reports/taglist.xml
A         torque-site/src/site/xdoc/documentation/modules/maven-plugin/reports/jdepend-report.xml
A         torque-site/src/site/xdoc/documentation/modules/maven-plugin/dependencies.xml
A         torque-site/src/site/xdoc/documentation/modules/maven-plugin/index.xml
A         torque-site/src/site/xdoc/documentation/modules/runtime
A         torque-site/src/site/xdoc/documentation/modules/runtime/dependencies.xml
AU        torque-site/src/site/xdoc/documentation/modules/runtime/index.xml
A         torque-site/src/site/xdoc/documentation/modules/runtime/reports
A         torque-site/src/site/xdoc/documentation/modules/runtime/reports/jdepend-report.xml
A         torque-site/src/site/xdoc/documentation/modules/runtime/reports/index.xml
A         torque-site/src/site/xdoc/documentation/modules/runtime/reports/taglist.xml
A         torque-site/src/site/xdoc/documentation/modules/ant-tasks
A         torque-site/src/site/xdoc/documentation/modules/ant-tasks/dependencies.xml
A         torque-site/src/site/xdoc/documentation/modules/ant-tasks/index.xml
A         torque-site/src/site/xdoc/documentation/modules/ant-tasks/reference
A         torque-site/src/site/xdoc/documentation/modules/ant-tasks/reference/generator-task.xml
A         torque-site/src/site/xdoc/documentation/modules/ant-tasks/reference/index.xml
A         torque-site/src/site/xdoc/documentation/modules/ant-tasks/reports
A         torque-site/src/site/xdoc/documentation/modules/ant-tasks/reports/jdepend-report.xml
A         torque-site/src/site/xdoc/documentation/modules/ant-tasks/reports/index.xml
A         torque-site/src/site/xdoc/documentation/modules/ant-tasks/reports/taglist.xml
A         torque-site/src/site/xdoc/documentation/modules/generator
A         torque-site/src/site/xdoc/documentation/modules/generator/dependencies.xml
A         torque-site/src/site/xdoc/documentation/modules/generator/index.xml
A         torque-site/src/site/xdoc/documentation/modules/generator/reports
A         torque-site/src/site/xdoc/documentation/modules/generator/reports/index.xml
A         torque-site/src/site/xdoc/documentation/modules/generator/reports/taglist.xml
A         torque-site/src/site/xdoc/documentation/modules/generator/reports/jdepend-report.xml
A         torque-site/src/site/xdoc/documentation/modules/index.xml
A         torque-site/src/site/xdoc/documentation/orm-reference
A         torque-site/src/site/xdoc/documentation/orm-reference/customizing-generation.xml
AU        torque-site/src/site/xdoc/documentation/orm-reference/new-database-support.xml
A         torque-site/src/site/xdoc/documentation/orm-reference/index.xml
A         torque-site/src/site/xdoc/documentation/orm-reference/migration-from-torque-3.xml
A         torque-site/src/site/xdoc/documentation/orm-reference/supported-databases.xml
A         torque-site/src/site/xdoc/documentation/orm-reference/relevant-classes.xml
A         torque-site/src/site/xdoc/documentation/orm-reference/avalon.xml
A         torque-site/src/site/xdoc/documentation/orm-reference/exceptions.xml
A         torque-site/src/site/xdoc/documentation/orm-reference/extend-classes.xml
A         torque-site/src/site/xdoc/documentation/orm-reference/running-the-generator.xml
A         torque-site/src/site/xdoc/documentation/orm-reference/database-independence.xml
AU        torque-site/src/site/xdoc/documentation/orm-reference/initialisation-configuration.xml
AU        torque-site/src/site/xdoc/documentation/orm-reference/beans.xml
A         torque-site/src/site/xdoc/documentation/orm-reference/connections-transactions.xml
AU        torque-site/src/site/xdoc/documentation/orm-reference/inheritance.xml
A         torque-site/src/site/xdoc/documentation/orm-reference/write-to-db.xml
AU        torque-site/src/site/xdoc/documentation/orm-reference/managers-cache.xml
A         torque-site/src/site/xdoc/documentation/orm-reference/defining-the-schema.xml
AU        torque-site/src/site/xdoc/documentation/orm-reference/read-from-db.xml
A         torque-site/src/site/xdoc/documentation/codegen-reference
A         torque-site/src/site/xdoc/documentation/codegen-reference/configuration.xml
A         torque-site/src/site/xdoc/documentation/codegen-reference/index.xml
A         torque-site/src/site/xdoc/documentation/codegen-reference/concepts.xml
A         torque-site/src/site/xdoc/documentation/codegen-reference/logging-debugging.xml
A         torque-site/src/site/xdoc/documentation/codegen-reference/existing-target-modes.xml
A         torque-site/src/site/xdoc/documentation/codegen-reference/generator-internals
A         torque-site/src/site/xdoc/documentation/codegen-reference/generator-internals/outletTypes.xml
A         torque-site/src/site/xdoc/documentation/codegen-reference/generator-internals/index.xml
A         torque-site/src/site/xdoc/documentation/codegen-reference/extending.xml
A         torque-site/src/site/xdoc/documentation/tutorial
A         torque-site/src/site/xdoc/documentation/tutorial/orm
AU        torque-site/src/site/xdoc/documentation/tutorial/orm/step2.xml
A         torque-site/src/site/xdoc/documentation/tutorial/orm/step3-ant.xml
AU        torque-site/src/site/xdoc/documentation/tutorial/orm/step4.xml
AU        torque-site/src/site/xdoc/documentation/tutorial/orm/step1-maven.xml
A         torque-site/src/site/xdoc/documentation/tutorial/orm/step5.xml
A         torque-site/src/site/xdoc/documentation/tutorial/orm/step6-ant.xml
AU        torque-site/src/site/xdoc/documentation/tutorial/orm/step3-maven.xml
A         torque-site/src/site/xdoc/documentation/tutorial/orm/step6-maven.xml
A         torque-site/src/site/xdoc/documentation/tutorial/orm/index.xml
A         torque-site/src/site/xdoc/documentation/tutorial/orm/step1-ant.xml
A         torque-site/src/site/xdoc/documentation/tutorial/codegen
AU        torque-site/src/site/xdoc/documentation/tutorial/codegen/gettingStarted.xml
A         torque-site/src/site/xdoc/documentation/tutorial/index.xml
A         torque-site/src/site/xdoc/developer-info
AU        torque-site/src/site/xdoc/developer-info/subversion.xml
AU        torque-site/src/site/xdoc/developer-info/developer-guide.xml
AU        torque-site/src/site/xdoc/developer-info/references.xml
A         torque-site/src/site/xdoc/developer-info/site-edit-deploy.xml
A         torque-site/src/site/xdoc/developer-info/contributions.xml
A         torque-site/src/site/xdoc/developer-info/test-project.xml
A         torque-site/src/site/xdoc/developer-info/index.xml
A         torque-site/src/site/xdoc/developer-info/codestyle.xml
A         torque-site/src/site/xdoc/project-info.xml
A         torque-site/src/site/xdoc/tools.xml
A         torque-site/src/site/xdoc/project-reports.xml
AU        torque-site/src/site/xdoc/status.xml
AU        torque-site/pom.xml
A         torque-site/LICENSE.txt
A         LICENSE
A         torque-ant-tasks
A         torque-ant-tasks/src
A         torque-ant-tasks/src/test
A         torque-ant-tasks/src/test/java
A         torque-ant-tasks/src/test/java/org
A         torque-ant-tasks/src/test/java/org/apache
A         torque-ant-tasks/src/test/java/org/apache/torque
A         torque-ant-tasks/src/test/java/org/apache/torque/ant
A         torque-ant-tasks/src/test/java/org/apache/torque/ant/task
AU        torque-ant-tasks/src/test/java/org/apache/torque/ant/task/TorqueGeneratorTaskTest.java
A         torque-ant-tasks/src/test/torqueGeneratorTaskTest
A         torque-ant-tasks/src/test/torqueGeneratorTaskTest/src
A         torque-ant-tasks/src/test/torqueGeneratorTaskTest/src/main
A         torque-ant-tasks/src/test/torqueGeneratorTaskTest/src/main/torque-gen
A         torque-ant-tasks/src/test/torqueGeneratorTaskTest/src/main/torque-gen/src
A         torque-ant-tasks/src/test/torqueGeneratorTaskTest/src/main/torque-gen/src/propertiesData.properties
A         torque-ant-tasks/src/test/torqueGeneratorTaskTest/src/main/torque-gen/templates
A         torque-ant-tasks/src/test/torqueGeneratorTaskTest/src/main/torque-gen/templates/keyField.vm
A         torque-ant-tasks/src/test/torqueGeneratorTaskTest/src/main/torque-gen/templates/classFrame.vm
A         torque-ant-tasks/src/test/torqueGeneratorTaskTest/src/main/torque-gen/templates/constructor.vm
A         torque-ant-tasks/src/test/torqueGeneratorTaskTest/src/main/torque-gen/templates/getKey.vm
A         torque-ant-tasks/src/test/torqueGeneratorTaskTest/src/main/torque-gen/templates/constant.vm
A         torque-ant-tasks/src/test/torqueGeneratorTaskTest/src/main/torque-gen/templates/toString.vm
A         torque-ant-tasks/src/test/torqueGeneratorTaskTest/src/main/torque-gen/outlets
A         torque-ant-tasks/src/test/torqueGeneratorTaskTest/src/main/torque-gen/outlets/enumOutlets.xml
A         torque-ant-tasks/src/test/torqueGeneratorTaskTest/src/main/torque-gen/conf
A         torque-ant-tasks/src/test/torqueGeneratorTaskTest/src/main/torque-gen/conf/control.xml
A         torque-ant-tasks/src/test/resources
A         torque-ant-tasks/src/test/resources/org
A         torque-ant-tasks/src/test/resources/org/apache
A         torque-ant-tasks/src/test/resources/org/apache/torque
A         torque-ant-tasks/src/test/resources/org/apache/torque/ant
AU        torque-ant-tasks/src/test/resources/org/apache/torque/ant/PropertyKeys.java
A         torque-ant-tasks/src/main
A         torque-ant-tasks/src/main/java
A         torque-ant-tasks/src/main/java/org
A         torque-ant-tasks/src/main/java/org/apache
A         torque-ant-tasks/src/main/java/org/apache/torque
A         torque-ant-tasks/src/main/java/org/apache/torque/ant
A         torque-ant-tasks/src/main/java/org/apache/torque/ant/task
AU        torque-ant-tasks/src/main/java/org/apache/torque/ant/task/package.html
AU        torque-ant-tasks/src/main/java/org/apache/torque/ant/task/Option.java
AU        torque-ant-tasks/src/main/java/org/apache/torque/ant/task/TorqueGeneratorTask.java
A         torque-ant-tasks/src/main/plugin-config
A         torque-ant-tasks/src/main/plugin-config/findbugs-exclude.xml
A         torque-ant-tasks/pom.xml
A         torque-ant-tasks/LICENSE.txt
A         torque-ant-tasks/NOTICE
A         torque-ant-tasks/LICENSE-EDL.txt
 U        .
At revision 1798819

Parsing POMs
Established TCP socket on 46049
maven35-agent.jar already up to date
maven35-interceptor.jar already up to date
maven3-interceptor-commons.jar already up to date
[torque4-trunk] $ /home/jenkins/tools/java/latest1.8/bin/java -Xmx2g -Xms256m -cp /home/jenkins/jenkins-slave/maven35-agent.jar:/home/jenkins/tools/maven/latest3/boot/plexus-classworlds-2.5.2.jar:/home/jenkins/tools/maven/latest3/conf/logging jenkins.maven3.agent.Maven35Main /home/jenkins/tools/maven/latest3/ /home/jenkins/jenkins-slave/slave.jar /home/jenkins/jenkins-slave/maven35-interceptor.jar /home/jenkins/jenkins-slave/maven3-interceptor-commons.jar 46049
#
# There is insufficient memory for the Java Runtime Environment to continue.
# Cannot create GC thread. Out of system resources.
# An error report file with more information is saved as:
# <https://builds.apache.org/job/Torque4-trunk/ws/torque4-trunk/hs_err_pid18906.log>
ERROR: Failed to launch Maven. Exit code = 1
Skipping Cobertura coverage report as build was not UNSTABLE or better ...

---------------------------------------------------------------------
To unsubscribe, e-mail: [hidden email]
For additional commands, e-mail: [hidden email]

Reply | Threaded
Open this post in threaded view
|

Build failed in Jenkins: Torque4-trunk #576

Apache Jenkins Server-2
See <https://builds.apache.org/job/Torque4-trunk/576/display/redirect?page=changes>

Changes:

[tv] Get rid of synchronization in getDatabaseMap()
Fix bad column names for IDBroker

------------------------------------------
[...truncated 213.22 KB...]
Running org.apache.torque.util.functions.MaxTest
Tests run: 4, Failures: 0, Errors: 0, Skipped: 0, Time elapsed: 0.021 sec - in org.apache.torque.util.functions.MaxTest
Running org.apache.torque.util.functions.CountTest
Tests run: 4, Failures: 0, Errors: 0, Skipped: 0, Time elapsed: 0.021 sec - in org.apache.torque.util.functions.CountTest
Running org.apache.torque.util.functions.SumTest
Tests run: 4, Failures: 0, Errors: 0, Skipped: 0, Time elapsed: 0.021 sec - in org.apache.torque.util.functions.SumTest
Running org.apache.torque.util.functions.AggregateFunctionTest
Tests run: 12, Failures: 0, Errors: 0, Skipped: 0, Time elapsed: 0.022 sec - in org.apache.torque.util.functions.AggregateFunctionTest
Running org.apache.torque.util.functions.AbstractFunctionTest
Tests run: 11, Failures: 0, Errors: 0, Skipped: 0, Time elapsed: 0.027 sec - in org.apache.torque.util.functions.AbstractFunctionTest
Running org.apache.torque.criteria.CriteriaTest
Tests run: 33, Failures: 0, Errors: 0, Skipped: 0, Time elapsed: 0.325 sec - in org.apache.torque.criteria.CriteriaTest
Running org.apache.torque.criteria.JoinTest
Tests run: 2, Failures: 0, Errors: 0, Skipped: 0, Time elapsed: 0.133 sec - in org.apache.torque.criteria.JoinTest
Running org.apache.torque.criteria.CriterionTest
Tests run: 10, Failures: 0, Errors: 0, Skipped: 0, Time elapsed: 0.158 sec - in org.apache.torque.criteria.CriterionTest
Running org.apache.torque.ColumnImplTest
Tests run: 41, Failures: 0, Errors: 0, Skipped: 0, Time elapsed: 0.197 sec - in org.apache.torque.ColumnImplTest
Running org.apache.torque.adapter.DBOracleTest
Tests run: 1, Failures: 0, Errors: 0, Skipped: 0, Time elapsed: 0.043 sec - in org.apache.torque.adapter.DBOracleTest
Running org.apache.torque.manager.TestManager
Tests run: 0, Failures: 0, Errors: 0, Skipped: 0, Time elapsed: 0 sec - in org.apache.torque.manager.TestManager
Running org.apache.torque.manager.MethodResultCacheTest
Apr 06, 2018 9:25:11 AM org.apache.commons.jcs.engine.control.CompositeCacheManager getInstance
INFO: Instance is null, creating with config [/cache.ccf]
Apr 06, 2018 9:25:11 AM org.apache.commons.jcs.engine.control.CompositeCacheManager configure
INFO: Creating cache manager from config file: /cache.ccf
Apr 06, 2018 9:25:11 AM org.apache.commons.jcs.utils.threadpool.ThreadPoolManager loadConfig
INFO: thread_pool.default PoolConfiguration = useBoundary = [false] boundarySize = [2000] maximumPoolSize = [150] minimumPoolSize = [4] keepAliveTime = [300000] whenBlockedPolicy = [RUN] startUpSize = [4]
Apr 06, 2018 9:25:11 AM org.apache.commons.jcs.engine.control.CompositeCacheManager doConfigure
INFO: Setting default auxiliaries to
Apr 06, 2018 9:25:11 AM org.apache.commons.jcs.engine.control.CompositeCacheManager doConfigure
INFO: setting defaultCompositeCacheAttributes to [ useLateral = true, useRemote = true, useDisk = true, maxObjs = 1000, maxSpoolPerRun = -1, diskUsagePattern = SWAP, spoolChunkSize = 2 ]
Apr 06, 2018 9:25:11 AM org.apache.commons.jcs.engine.control.CompositeCacheConfigurator parseElementAttributes
INFO: No special ElementAttribute class defined for key [jcs.default.elementattributes], using default class.
Apr 06, 2018 9:25:11 AM org.apache.commons.jcs.engine.control.CompositeCacheManager doConfigure
INFO: setting defaultElementAttributes to [ IS_LATERAL = true, IS_SPOOL = true, IS_REMOTE = true, IS_ETERNAL = true, MaxLifeSeconds = -1, IdleTime = -1, CreateTime = 1523006711245, LastAccessTime = 1523006711245, getTimeToLiveSeconds() = -1, createTime = 1523006711245 ]
Apr 06, 2018 9:25:11 AM org.apache.commons.jcs.engine.control.CompositeCacheConfigurator parseElementAttributes
INFO: No special ElementAttribute class defined for key [jcs.region.testCache1.elementattributes], using default class.
Apr 06, 2018 9:25:11 AM org.apache.commons.jcs.engine.memory.AbstractDoubleLinkedListMemoryCache initialize
INFO: initialized MemoryCache for testCache1
Apr 06, 2018 9:25:11 AM org.apache.commons.jcs.engine.control.CompositeCache <init>
INFO: Constructed cache with name [testCache1] and cache attributes [ useLateral = true, useRemote = true, useDisk = true, maxObjs = 1000, maxSpoolPerRun = -1, diskUsagePattern = SWAP, spoolChunkSize = 2 ]
Apr 06, 2018 9:25:11 AM org.apache.commons.jcs.engine.control.CompositeCacheConfigurator parseRegions
INFO: Parsed regions [testCache1]
Apr 06, 2018 9:25:11 AM org.apache.commons.jcs.engine.control.CompositeCacheManager doConfigure
INFO: Finished configuration in 30 ms.
Tests run: 3, Failures: 0, Errors: 0, Skipped: 0, Time elapsed: 0.284 sec - in org.apache.torque.manager.MethodResultCacheTest
Running org.apache.torque.manager.TestPersistent
Tests run: 0, Failures: 0, Errors: 0, Skipped: 0, Time elapsed: 0 sec - in org.apache.torque.manager.TestPersistent
Running org.apache.torque.manager.AbstractBaseManagerTest
Apr 06, 2018 9:25:12 AM org.apache.commons.jcs.engine.control.CompositeCacheManager getInstance
INFO: Instance is null, creating with config [/cache.ccf]
Apr 06, 2018 9:25:12 AM org.apache.commons.jcs.engine.control.CompositeCacheManager configure
INFO: Creating cache manager from config file: /cache.ccf
Apr 06, 2018 9:25:12 AM org.apache.commons.jcs.utils.threadpool.ThreadPoolManager loadConfig
INFO: thread_pool.default PoolConfiguration = useBoundary = [false] boundarySize = [2000] maximumPoolSize = [150] minimumPoolSize = [4] keepAliveTime = [300000] whenBlockedPolicy = [RUN] startUpSize = [4]
Apr 06, 2018 9:25:12 AM org.apache.commons.jcs.engine.control.CompositeCacheManager doConfigure
INFO: Setting default auxiliaries to
Apr 06, 2018 9:25:12 AM org.apache.commons.jcs.engine.control.CompositeCacheManager doConfigure
INFO: setting defaultCompositeCacheAttributes to [ useLateral = true, useRemote = true, useDisk = true, maxObjs = 1000, maxSpoolPerRun = -1, diskUsagePattern = SWAP, spoolChunkSize = 2 ]
Apr 06, 2018 9:25:12 AM org.apache.commons.jcs.engine.control.CompositeCacheConfigurator parseElementAttributes
INFO: No special ElementAttribute class defined for key [jcs.default.elementattributes], using default class.
Apr 06, 2018 9:25:12 AM org.apache.commons.jcs.engine.control.CompositeCacheManager doConfigure
INFO: setting defaultElementAttributes to [ IS_LATERAL = true, IS_SPOOL = true, IS_REMOTE = true, IS_ETERNAL = true, MaxLifeSeconds = -1, IdleTime = -1, CreateTime = 1523006712631, LastAccessTime = 1523006712631, getTimeToLiveSeconds() = -1, createTime = 1523006712631 ]
Apr 06, 2018 9:25:12 AM org.apache.commons.jcs.engine.control.CompositeCacheConfigurator parseElementAttributes
INFO: No special ElementAttribute class defined for key [jcs.region.testCache1.elementattributes], using default class.
Apr 06, 2018 9:25:12 AM org.apache.commons.jcs.engine.memory.AbstractDoubleLinkedListMemoryCache initialize
INFO: initialized MemoryCache for testCache1
Apr 06, 2018 9:25:12 AM org.apache.commons.jcs.engine.control.CompositeCache <init>
INFO: Constructed cache with name [testCache1] and cache attributes [ useLateral = true, useRemote = true, useDisk = true, maxObjs = 1000, maxSpoolPerRun = -1, diskUsagePattern = SWAP, spoolChunkSize = 2 ]
Apr 06, 2018 9:25:12 AM org.apache.commons.jcs.engine.control.CompositeCacheConfigurator parseRegions
INFO: Parsed regions [testCache1]
Apr 06, 2018 9:25:12 AM org.apache.commons.jcs.engine.control.CompositeCacheManager doConfigure
INFO: Finished configuration in 30 ms.
Tests run: 9, Failures: 0, Errors: 0, Skipped: 0, Time elapsed: 0.281 sec - in org.apache.torque.manager.AbstractBaseManagerTest
Apr 06, 2018 9:25:12 AM org.apache.commons.jcs.engine.control.CompositeCacheManager run
INFO: Shutdown hook activated.  Shutdown was not called.  Shutting down JCS.

Results :

Tests run: 365, Failures: 0, Errors: 0, Skipped: 0

[JENKINS] Recording test results
[INFO]
[INFO] --- maven-jar-plugin:3.0.0:jar (default-jar) @ torque-runtime ---
[INFO] Building jar: <https://builds.apache.org/job/Torque4-trunk/ws/torque4-trunk/torque-runtime/target/torque-runtime-4.1-SNAPSHOT.jar>
[INFO]
[INFO] --- maven-site-plugin:3.5.1:attach-descriptor (attach-descriptor) @ torque-runtime ---
[INFO]
[INFO] --- maven-source-plugin:3.0.0:jar-no-fork (attach-sources) @ torque-runtime ---
[INFO] Building jar: <https://builds.apache.org/job/Torque4-trunk/ws/torque4-trunk/torque-runtime/target/torque-runtime-4.1-SNAPSHOT-sources.jar>
[INFO]
[INFO] --- apache-rat-plugin:0.11:check (default) @ torque-runtime ---
[INFO] 51 implicit excludes (use -debug for more details).
[INFO] Exclude: velocity.log
[INFO] Exclude: .checkstyle
[INFO] Exclude: checkstyle-cache.ccf
[INFO] Exclude: derby.log
[INFO] Exclude: LICENSE-EDL.txt
[INFO] Exclude: DEPENDENCIES
[INFO] Exclude: torque-test/target/**/*
[INFO] Exclude: torque-test/.classpath
[INFO] Exclude: torque-test/.project
[INFO] Exclude: torque-test/.settings/**
[INFO] Exclude: torque-test/src/main/generated-java/**/*
[INFO] Exclude: torque-test/derby.log
[INFO] 182 resources included (use -debug for more details)
[INFO] Rat check: Summary of files. Unapproved: 0 unknown: 0 generated: 0 approved: 180 licence.
[CHECKSTYLE] No report found for mojo check
[PMD] No report found for mojo check[INFO]

[INFO] --- maven-install-plugin:2.5.2:install (default-install) @ torque-runtime ---
[INFO] Installing <https://builds.apache.org/job/Torque4-trunk/ws/torque4-trunk/torque-runtime/target/torque-runtime-4.1-SNAPSHOT.jar> to /home/jenkins/jenkins-slave/maven-repositories/0/org/apache/torque/torque-runtime/4.1-SNAPSHOT/torque-runtime-4.1-SNAPSHOT.jar
[INFO] Installing <https://builds.apache.org/job/Torque4-trunk/ws/torque4-trunk/torque-runtime/pom.xml> to /home/jenkins/jenkins-slave/maven-repositories/0/org/apache/torque/torque-runtime/4.1-SNAPSHOT/torque-runtime-4.1-SNAPSHOT.pom
[INFO] Installing <https://builds.apache.org/job/Torque4-trunk/ws/torque4-trunk/torque-runtime/target/torque-runtime-4.1-SNAPSHOT-sources.jar> to /home/jenkins/jenkins-slave/maven-repositories/0/org/apache/torque/torque-runtime/4.1-SNAPSHOT/torque-runtime-4.1-SNAPSHOT-sources.jar
[INFO]
[INFO] >>> cobertura-maven-plugin:2.3:cobertura (default-cli) > [cobertura]test @ torque-runtime >>>
[INFO]
[INFO] --- maven-remote-resources-plugin:1.5:process (process-resource-bundles) @ torque-runtime ---
[INFO]
[INFO] --- maven-resources-plugin:2.7:resources (default-resources) @ torque-runtime ---
[INFO] Using 'ISO-8859-1' encoding to copy filtered resources.
[INFO] skip non existing resourceDirectory <https://builds.apache.org/job/Torque4-trunk/ws/torque4-trunk/torque-runtime/src/main/resources>
[INFO] Copying 3 resources
[INFO] Copying 3 resources
[INFO]
[INFO] --- maven-compiler-plugin:3.5.1:compile (default-compile) @ torque-runtime ---
[INFO] Nothing to compile - all classes are up to date
[INFO]
[INFO] --- cobertura-maven-plugin:2.3:instrument (default-cli) @ torque-runtime ---
[INFO] Cobertura 1.9.2 - GNU GPL License (NO WARRANTY) - See COPYRIGHT file
Instrumenting 122 files to <https://builds.apache.org/job/Torque4-trunk/ws/torque4-trunk/torque-runtime/target/generated-classes/cobertura>
Cobertura: Saved information on 122 classes.
Instrument time: 519ms

[INFO] Instrumentation was successful.
[INFO]
[INFO] --- maven-resources-plugin:2.7:testResources (default-testResources) @ torque-runtime ---
[INFO] Using 'ISO-8859-1' encoding to copy filtered resources.
[INFO] Copying 5 resources
[INFO] Copying 3 resources
[INFO] Copying 3 resources
[INFO]
[INFO] --- maven-compiler-plugin:3.5.1:testCompile (default-testCompile) @ torque-runtime ---
[INFO] Nothing to compile - all classes are up to date
[INFO]
[INFO] --- maven-surefire-plugin:2.19.1:test (default-test) @ torque-runtime ---

-------------------------------------------------------
 T E S T S
-------------------------------------------------------

Results :

Tests run: 0, Failures: 0, Errors: 0, Skipped: 0

[JENKINS] Recording test results
[INFO] ------------------------------------------------------------------------
[INFO] Reactor Summary:
[INFO]
[INFO] Torque Maven Parent ................................ SUCCESS [01:18 min]
[INFO] Torque Runtime ..................................... FAILURE [ 50.189 s]
[INFO] Torque Generator ................................... SKIPPED
[INFO] Torque Templates ................................... SKIPPED
[INFO] Torque Generator Maven 2 Plugin .................... SKIPPED
[INFO] Torque Generator Ant tasks ......................... SKIPPED
[INFO] Torque Site ........................................ SKIPPED
[INFO] ------------------------------------------------------------------------
[INFO] BUILD FAILURE
[INFO] ------------------------------------------------------------------------
[INFO] Total time: 02:26 min
[INFO] Finished at: 2018-04-06T09:25:39Z
[INFO] Final Memory: 65M/944M
[INFO] ------------------------------------------------------------------------
[ERROR] Failed to execute goal org.apache.maven.plugins:maven-surefire-plugin:2.19.1:test (default-test) on project torque-runtime: Execution default-test of goal org.apache.maven.plugins:maven-surefire-plugin:2.19.1:test failed: There was an error in the forked process
[ERROR] java.lang.VerifyError:
[ERROR] Expecting a stackmap frame at branch target 107
[ERROR] Exception Details:
[ERROR] Location:
[ERROR] org/apache/torque/manager/AbstractBaseManager.dispose()V @32: ifnull
[ERROR] Reason:
[ERROR] Expected stackmap frame at this location.
[ERROR] Bytecode:
[ERROR] 0x0000000: 033c 11ff ff3d b800 2e12 30b6 0034 1101
[ERROR] 0x0000010: 17b6 003a 2ab4 00c0 1101 173c 1100 003d
[ERROR] 0x0000020: c600 4b1b 1101 17a0 001c 1c11 0000 a000
[ERROR] 0x0000030: 15b8 002e 1230 b600 341b 1c04 b600 9c11
[ERROR] 0x0000040: ffff 3db8 002e 1230 b600 3411 0119 b600
[ERROR] 0x0000050: 3a2a b400 c0b6 00d3 b800 2e12 30b6 0034
[ERROR] 0x0000060: 1101 1ab6 003a 2a01 b500 c01c 9b00 15b8
[ERROR] 0x0000070: 002e 1230 b600 341b 1c03 b600 9c11 ffff
[ERROR] 0x0000080: 3db8 002e 1230 b600 3411 011d b600 3a2a
[ERROR] 0x0000090: b400 d511 011d 3c11 0000 3dc6 004b 1b11
[ERROR] 0x00000a0: 011d a000 1c1c 1100 00a0 0015 b800 2e12
[ERROR] 0x00000b0: 30b6 0034 1b1c 04b6 009c 11ff ff3d b800
[ERROR] 0x00000c0: 2e12 30b6 0034 1101 1fb6 003a 2ab4 00d5
[ERROR] 0x00000d0: b600 d8b8 002e 1230 b600 3411 0120 b600
[ERROR] 0x00000e0: 3a2a 01b5 00d5 1c9b 0015 b800 2e12 30b6
[ERROR] 0x00000f0: 0034 1b1c 03b6 009c 11ff ff3d b800 2e12
[ERROR] 0x0000100: 30b6 0034 1101 23b6 003a 2ab4 0043 b600
[ERROR] 0x0000110: d9b8 002e 1230 b600 3411 0124 b600 3a2a
[ERROR] 0x0000120: b400 48b9 00dc 0100 b800 2e12 30b6 0034
[ERROR] 0x0000130: 1101 25b6 003a b1
[ERROR] Stackmap Table:
[ERROR] same_frame_extended(@143)
[ERROR] same_frame_extended(@266)
[ERROR]
[ERROR] at java.lang.Class.getDeclaredMethods0(Native Method)
[ERROR] at java.lang.Class.privateGetDeclaredMethods(Class.java:2701)
[ERROR] at java.lang.Class.privateGetMethodRecursive(Class.java:3048)
[ERROR] at java.lang.Class.getMethod0(Class.java:3018)
[ERROR] at java.lang.Class.getMethod(Class.java:1784)
[ERROR] at org.apache.maven.surefire.util.ReflectionUtils.tryGetMethod(ReflectionUtils.java:61)
[ERROR] at org.apache.maven.surefire.common.junit3.JUnit3TestChecker.isSuiteOnly(JUnit3TestChecker.java:64)
[ERROR] at org.apache.maven.surefire.common.junit3.JUnit3TestChecker.isValidJUnit3Test(JUnit3TestChecker.java:59)
[ERROR] at org.apache.maven.surefire.common.junit3.JUnit3TestChecker.accept(JUnit3TestChecker.java:54)
[ERROR] at org.apache.maven.surefire.junit.PojoAndJUnit3Checker.accept(PojoAndJUnit3Checker.java:43)
[ERROR] at org.apache.maven.surefire.util.DefaultScanResult.applyFilter(DefaultScanResult.java:98)
[ERROR] at org.apache.maven.surefire.junit.JUnit3Provider.scanClassPath(JUnit3Provider.java:143)
[ERROR] at org.apache.maven.surefire.junit.JUnit3Provider.invoke(JUnit3Provider.java:87)
[ERROR] at org.apache.maven.surefire.booter.ForkedBooter.invokeProviderInSameClassLoader(ForkedBooter.java:290)
[ERROR] at org.apache.maven.surefire.booter.ForkedBooter.runSuitesInProcess(ForkedBooter.java:242)
[ERROR] at org.apache.maven.surefire.booter.ForkedBooter.main(ForkedBooter.java:121)
[ERROR] -> [Help 1]
[ERROR]
[ERROR] To see the full stack trace of the errors, re-run Maven with the -e switch.
[ERROR] Re-run Maven using the -X switch to enable full debug logging.
[ERROR]
[ERROR] For more information about the errors and possible solutions, please read the following articles:
[ERROR] [Help 1] http://cwiki.apache.org/confluence/display/MAVEN/PluginExecutionException
[ERROR]
[ERROR] After correcting the problems, you can resume the build with the command
[ERROR]   mvn <goals> -rf :torque-runtime
[JENKINS] Archiving <https://builds.apache.org/job/Torque4-trunk/ws/torque4-trunk/torque-maven-plugin/pom.xml> to org.apache.torque/torque-maven-plugin/4.1-SNAPSHOT/torque-maven-plugin-4.1-SNAPSHOT.pom
[JENKINS] Archiving <https://builds.apache.org/job/Torque4-trunk/ws/torque4-trunk/pom.xml> to org.apache.torque/torque/4.1-SNAPSHOT/torque-4.1-SNAPSHOT.pom
<https://builds.apache.org/job/Torque4-trunk/ws/torque4-trunk/pom.xml> is not inside <https://builds.apache.org/job/Torque4-trunk/ws/torque4-trunk/torque4-trunk/;> will archive in a separate pass
[JENKINS] Archiving <https://builds.apache.org/job/Torque4-trunk/ws/torque4-trunk/torque-site/pom.xml> to org.apache.torque/torque-site/4.1-SNAPSHOT/torque-site-4.1-SNAPSHOT.pom
[JENKINS] Archiving <https://builds.apache.org/job/Torque4-trunk/ws/torque4-trunk/torque-generator/pom.xml> to org.apache.torque/torque-generator/4.1-SNAPSHOT/torque-generator-4.1-SNAPSHOT.pom
[JENKINS] Archiving <https://builds.apache.org/job/Torque4-trunk/ws/torque4-trunk/torque-templates/pom.xml> to org.apache.torque/torque-templates/4.1-SNAPSHOT/torque-templates-4.1-SNAPSHOT.pom
[JENKINS] Archiving <https://builds.apache.org/job/Torque4-trunk/ws/torque4-trunk/torque-runtime/pom.xml> to org.apache.torque/torque-runtime/4.1-SNAPSHOT/torque-runtime-4.1-SNAPSHOT.pom
[JENKINS] Archiving <https://builds.apache.org/job/Torque4-trunk/ws/torque4-trunk/torque-runtime/target/torque-runtime-4.1-SNAPSHOT.jar> to org.apache.torque/torque-runtime/4.1-SNAPSHOT/torque-runtime-4.1-SNAPSHOT.jar
[JENKINS] Archiving <https://builds.apache.org/job/Torque4-trunk/ws/torque4-trunk/torque-runtime/target/torque-runtime-4.1-SNAPSHOT-sources.jar> to org.apache.torque/torque-runtime/4.1-SNAPSHOT/torque-runtime-4.1-SNAPSHOT-sources.jar
[JENKINS] Archiving <https://builds.apache.org/job/Torque4-trunk/ws/torque4-trunk/torque-ant-tasks/pom.xml> to org.apache.torque/torque-ant-tasks/4.1-SNAPSHOT/torque-ant-tasks-4.1-SNAPSHOT.pom
Sending e-mails to: [hidden email]
Sending e-mails to: [hidden email]
channel stopped
[Cobertura] Publishing Cobertura coverage report...


---------------------------------------------------------------------
To unsubscribe, e-mail: [hidden email]
For additional commands, e-mail: [hidden email]

Reply | Threaded
Open this post in threaded view
|

Build failed in Jenkins: Torque4-trunk #577

Apache Jenkins Server-2
See <https://builds.apache.org/job/Torque4-trunk/577/display/redirect?page=changes>

Changes:

[tv] Use ConcurrentMap

[tv] - Introduce dependency management to keep dependency versions consistent
- Update dependencies commons-collections, commons-dbcp2, commons-jcs-core etc

------------------------------------------
[...truncated 187.71 KB...]
INFO: thread_pool.default PoolConfiguration = useBoundary = [false] boundarySize = [2000] maximumPoolSize = [150] minimumPoolSize = [4] keepAliveTime = [300000] whenBlockedPolicy = [RUN] startUpSize = [4]
Apr 06, 2018 1:25:44 PM org.apache.commons.jcs.engine.control.CompositeCacheManager doConfigure
INFO: Setting default auxiliaries to
Apr 06, 2018 1:25:44 PM org.apache.commons.jcs.engine.control.CompositeCacheManager doConfigure
INFO: setting defaultCompositeCacheAttributes to [ useLateral = true, useRemote = true, useDisk = true, maxObjs = 1000, maxSpoolPerRun = -1, diskUsagePattern = SWAP, spoolChunkSize = 2 ]
Apr 06, 2018 1:25:44 PM org.apache.commons.jcs.engine.control.CompositeCacheConfigurator parseElementAttributes
INFO: No special ElementAttribute class defined for key [jcs.default.elementattributes], using default class.
Apr 06, 2018 1:25:44 PM org.apache.commons.jcs.engine.control.CompositeCacheManager doConfigure
INFO: setting defaultElementAttributes to [ IS_LATERAL = true, IS_SPOOL = true, IS_REMOTE = true, IS_ETERNAL = true, MaxLifeSeconds = -1, IdleTime = -1, CreateTime = 1523021144776, LastAccessTime = 1523021144776, getTimeToLiveSeconds() = -1, createTime = 1523021144776 ]
Apr 06, 2018 1:25:44 PM org.apache.commons.jcs.engine.control.CompositeCacheConfigurator parseElementAttributes
INFO: No special ElementAttribute class defined for key [jcs.region.testCache1.elementattributes], using default class.
Apr 06, 2018 1:25:44 PM org.apache.commons.jcs.engine.memory.AbstractDoubleLinkedListMemoryCache initialize
INFO: initialized MemoryCache for testCache1
Apr 06, 2018 1:25:44 PM org.apache.commons.jcs.engine.control.CompositeCache <init>
INFO: Constructed cache with name [testCache1] and cache attributes [ useLateral = true, useRemote = true, useDisk = true, maxObjs = 1000, maxSpoolPerRun = -1, diskUsagePattern = SWAP, spoolChunkSize = 2 ]
Apr 06, 2018 1:25:44 PM org.apache.commons.jcs.engine.control.CompositeCacheConfigurator parseRegions
INFO: Parsed regions [testCache1]
Apr 06, 2018 1:25:44 PM org.apache.commons.jcs.engine.control.CompositeCacheManager doConfigure
INFO: Finished configuration in 28 ms.
Tests run: 3, Failures: 0, Errors: 0, Skipped: 0, Time elapsed: 0.381 sec - in org.apache.torque.manager.MethodResultCacheTest
Running org.apache.torque.manager.AbstractBaseManagerTest
Apr 06, 2018 1:25:45 PM org.apache.commons.jcs.engine.control.CompositeCacheManager getInstance
INFO: Instance is null, creating with config [/cache.ccf]
Apr 06, 2018 1:25:45 PM org.apache.commons.jcs.engine.control.CompositeCacheManager configure
INFO: Creating cache manager from config file: /cache.ccf
Apr 06, 2018 1:25:45 PM org.apache.commons.jcs.utils.threadpool.ThreadPoolManager loadConfig
INFO: thread_pool.default PoolConfiguration = useBoundary = [false] boundarySize = [2000] maximumPoolSize = [150] minimumPoolSize = [4] keepAliveTime = [300000] whenBlockedPolicy = [RUN] startUpSize = [4]
Apr 06, 2018 1:25:45 PM org.apache.commons.jcs.engine.control.CompositeCacheManager doConfigure
INFO: Setting default auxiliaries to
Apr 06, 2018 1:25:45 PM org.apache.commons.jcs.engine.control.CompositeCacheManager doConfigure
INFO: setting defaultCompositeCacheAttributes to [ useLateral = true, useRemote = true, useDisk = true, maxObjs = 1000, maxSpoolPerRun = -1, diskUsagePattern = SWAP, spoolChunkSize = 2 ]
Apr 06, 2018 1:25:45 PM org.apache.commons.jcs.engine.control.CompositeCacheConfigurator parseElementAttributes
INFO: No special ElementAttribute class defined for key [jcs.default.elementattributes], using default class.
Apr 06, 2018 1:25:45 PM org.apache.commons.jcs.engine.control.CompositeCacheManager doConfigure
INFO: setting defaultElementAttributes to [ IS_LATERAL = true, IS_SPOOL = true, IS_REMOTE = true, IS_ETERNAL = true, MaxLifeSeconds = -1, IdleTime = -1, CreateTime = 1523021145615, LastAccessTime = 1523021145615, getTimeToLiveSeconds() = -1, createTime = 1523021145615 ]
Apr 06, 2018 1:25:45 PM org.apache.commons.jcs.engine.control.CompositeCacheConfigurator parseElementAttributes
INFO: No special ElementAttribute class defined for key [jcs.region.testCache1.elementattributes], using default class.
Apr 06, 2018 1:25:45 PM org.apache.commons.jcs.engine.memory.AbstractDoubleLinkedListMemoryCache initialize
INFO: initialized MemoryCache for testCache1
Apr 06, 2018 1:25:45 PM org.apache.commons.jcs.engine.control.CompositeCache <init>
INFO: Constructed cache with name [testCache1] and cache attributes [ useLateral = true, useRemote = true, useDisk = true, maxObjs = 1000, maxSpoolPerRun = -1, diskUsagePattern = SWAP, spoolChunkSize = 2 ]
Apr 06, 2018 1:25:45 PM org.apache.commons.jcs.engine.control.CompositeCacheConfigurator parseRegions
INFO: Parsed regions [testCache1]
Apr 06, 2018 1:25:45 PM org.apache.commons.jcs.engine.control.CompositeCacheManager doConfigure
INFO: Finished configuration in 30 ms.
Tests run: 9, Failures: 0, Errors: 0, Skipped: 0, Time elapsed: 0.296 sec - in org.apache.torque.manager.AbstractBaseManagerTest
Apr 06, 2018 1:25:45 PM org.apache.commons.jcs.engine.control.CompositeCacheManager run
INFO: Shutdown hook activated.  Shutdown was not called.  Shutting down JCS.
Running org.apache.torque.ColumnImplTest
Tests run: 41, Failures: 0, Errors: 0, Skipped: 0, Time elapsed: 0.214 sec - in org.apache.torque.ColumnImplTest
Running org.apache.torque.TorqueInstanceTest
Tests run: 5, Failures: 0, Errors: 0, Skipped: 0, Time elapsed: 0.143 sec - in org.apache.torque.TorqueInstanceTest
Running org.apache.torque.sql.SqlBuilderTest
Tests run: 130, Failures: 0, Errors: 0, Skipped: 0, Time elapsed: 0.617 sec - in org.apache.torque.sql.SqlBuilderTest
Running org.apache.torque.sql.QueryTest
Tests run: 2, Failures: 0, Errors: 0, Skipped: 0, Time elapsed: 0.131 sec - in org.apache.torque.sql.QueryTest
Running org.apache.torque.map.ColumnMapTest
Tests run: 3, Failures: 0, Errors: 0, Skipped: 0, Time elapsed: 0.129 sec - in org.apache.torque.map.ColumnMapTest
Running org.apache.torque.util.UniqueListTest
Tests run: 2, Failures: 0, Errors: 0, Skipped: 0, Time elapsed: 0.024 sec - in org.apache.torque.util.UniqueListTest
Running org.apache.torque.util.BasePeerImplTest
Tests run: 16, Failures: 0, Errors: 0, Skipped: 0, Time elapsed: 0.484 sec - in org.apache.torque.util.BasePeerImplTest
Running org.apache.torque.util.functions.SumTest
Tests run: 4, Failures: 0, Errors: 0, Skipped: 0, Time elapsed: 0.042 sec - in org.apache.torque.util.functions.SumTest
Running org.apache.torque.util.functions.MinTest
Tests run: 4, Failures: 0, Errors: 0, Skipped: 0, Time elapsed: 0.034 sec - in org.apache.torque.util.functions.MinTest
Running org.apache.torque.util.functions.CountTest
Tests run: 4, Failures: 0, Errors: 0, Skipped: 0, Time elapsed: 0.033 sec - in org.apache.torque.util.functions.CountTest
Running org.apache.torque.util.functions.AggregateFunctionTest
Tests run: 12, Failures: 0, Errors: 0, Skipped: 0, Time elapsed: 0.041 sec - in org.apache.torque.util.functions.AggregateFunctionTest
Running org.apache.torque.util.functions.MaxTest
Tests run: 4, Failures: 0, Errors: 0, Skipped: 0, Time elapsed: 0.032 sec - in org.apache.torque.util.functions.MaxTest
Running org.apache.torque.util.functions.AvgTest
Tests run: 4, Failures: 0, Errors: 0, Skipped: 0, Time elapsed: 0.036 sec - in org.apache.torque.util.functions.AvgTest
Running org.apache.torque.util.functions.AbstractFunctionTest
Tests run: 11, Failures: 0, Errors: 0, Skipped: 0, Time elapsed: 0.041 sec - in org.apache.torque.util.functions.AbstractFunctionTest
Running org.apache.torque.util.SummaryHelperTest
Tests run: 1, Failures: 0, Errors: 0, Skipped: 0, Time elapsed: 0.425 sec - in org.apache.torque.util.SummaryHelperTest

Results :

Tests run: 365, Failures: 0, Errors: 0, Skipped: 0

[JENKINS] Recording test results
[INFO]
[INFO] --- maven-jar-plugin:3.0.0:jar (default-jar) @ torque-runtime ---
[INFO] Building jar: <https://builds.apache.org/job/Torque4-trunk/ws/torque4-trunk/torque-runtime/target/torque-runtime-4.1-SNAPSHOT.jar>
[INFO]
[INFO] --- maven-site-plugin:3.5.1:attach-descriptor (attach-descriptor) @ torque-runtime ---
[INFO]
[INFO] --- maven-source-plugin:3.0.0:jar-no-fork (attach-sources) @ torque-runtime ---
[INFO] Building jar: <https://builds.apache.org/job/Torque4-trunk/ws/torque4-trunk/torque-runtime/target/torque-runtime-4.1-SNAPSHOT-sources.jar>
[INFO]
[INFO] --- apache-rat-plugin:0.11:check (default) @ torque-runtime ---
[INFO] 51 implicit excludes (use -debug for more details).
[INFO] Exclude: velocity.log
[INFO] Exclude: .checkstyle
[INFO] Exclude: checkstyle-cache.ccf
[INFO] Exclude: derby.log
[INFO] Exclude: LICENSE-EDL.txt
[INFO] Exclude: DEPENDENCIES
[INFO] Exclude: torque-test/target/**/*
[INFO] Exclude: torque-test/.classpath
[INFO] Exclude: torque-test/.project
[INFO] Exclude: torque-test/.settings/**
[INFO] Exclude: torque-test/src/main/generated-java/**/*
[INFO] Exclude: torque-test/derby.log
[INFO] 182 resources included (use -debug for more details)
[INFO] Rat check: Summary of files. Unapproved: 0 unknown: 0 generated: 0 approved: 180 licence.
[CHECKSTYLE] No report found for mojo check
[PMD] No report found for mojo check
[INFO]
[INFO] --- maven-install-plugin:2.5.2:install (default-install) @ torque-runtime ---
[INFO] Installing <https://builds.apache.org/job/Torque4-trunk/ws/torque4-trunk/torque-runtime/target/torque-runtime-4.1-SNAPSHOT.jar> to /home/jenkins/jenkins-slave/maven-repositories/1/org/apache/torque/torque-runtime/4.1-SNAPSHOT/torque-runtime-4.1-SNAPSHOT.jar
[INFO] Installing <https://builds.apache.org/job/Torque4-trunk/ws/torque4-trunk/torque-runtime/pom.xml> to /home/jenkins/jenkins-slave/maven-repositories/1/org/apache/torque/torque-runtime/4.1-SNAPSHOT/torque-runtime-4.1-SNAPSHOT.pom
[INFO] Installing <https://builds.apache.org/job/Torque4-trunk/ws/torque4-trunk/torque-runtime/target/torque-runtime-4.1-SNAPSHOT-sources.jar> to /home/jenkins/jenkins-slave/maven-repositories/1/org/apache/torque/torque-runtime/4.1-SNAPSHOT/torque-runtime-4.1-SNAPSHOT-sources.jar
[INFO]
[INFO] >>> cobertura-maven-plugin:2.3:cobertura (default-cli) > [cobertura]test @ torque-runtime >>>
[INFO]
[INFO] --- maven-remote-resources-plugin:1.5:process (process-resource-bundles) @ torque-runtime ---
[INFO]
[INFO] --- maven-resources-plugin:2.7:resources (default-resources) @ torque-runtime ---
[INFO] Using 'ISO-8859-1' encoding to copy filtered resources.
[INFO] skip non existing resourceDirectory <https://builds.apache.org/job/Torque4-trunk/ws/torque4-trunk/torque-runtime/src/main/resources>
[INFO] Copying 3 resources
[INFO] Copying 3 resources
[INFO]
[INFO] --- maven-compiler-plugin:3.5.1:compile (default-compile) @ torque-runtime ---
[INFO] Nothing to compile - all classes are up to date
[INFO]
[INFO] --- cobertura-maven-plugin:2.3:instrument (default-cli) @ torque-runtime ---
[INFO] Cobertura 1.9.2 - GNU GPL License (NO WARRANTY) - See COPYRIGHT file
Instrumenting 122 files to <https://builds.apache.org/job/Torque4-trunk/ws/torque4-trunk/torque-runtime/target/generated-classes/cobertura>
Cobertura: Saved information on 122 classes.
Instrument time: 462ms

[INFO] Instrumentation was successful.
[INFO]
[INFO] --- maven-resources-plugin:2.7:testResources (default-testResources) @ torque-runtime ---
[INFO] Using 'ISO-8859-1' encoding to copy filtered resources.
[INFO] Copying 5 resources
[INFO] Copying 3 resources
[INFO] Copying 3 resources
[INFO]
[INFO] --- maven-compiler-plugin:3.5.1:testCompile (default-testCompile) @ torque-runtime ---
[INFO] Nothing to compile - all classes are up to date
[INFO]
[INFO] --- maven-surefire-plugin:2.19.1:test (default-test) @ torque-runtime ---

-------------------------------------------------------
 T E S T S
-------------------------------------------------------

Results :

Tests run: 0, Failures: 0, Errors: 0, Skipped: 0

[JENKINS] Recording test results
[INFO] ------------------------------------------------------------------------
[INFO] Reactor Summary:
[INFO]
[INFO] Torque Maven Parent ................................ SUCCESS [01:26 min]
[INFO] Torque Runtime ..................................... FAILURE [ 49.936 s]
[INFO] Torque Generator ................................... SKIPPED
[INFO] Torque Templates ................................... SKIPPED
[INFO] Torque Generator Maven 2 Plugin .................... SKIPPED
[INFO] Torque Generator Ant tasks ......................... SKIPPED
[INFO] Torque Site ........................................ SKIPPED
[INFO] ------------------------------------------------------------------------
[INFO] BUILD FAILURE
[INFO] ------------------------------------------------------------------------
[INFO] Total time: 02:34 min
[INFO] Finished at: 2018-04-06T13:26:24Z
[INFO] Final Memory: 63M/813M
[INFO] ------------------------------------------------------------------------
[ERROR] Failed to execute goal org.apache.maven.plugins:maven-surefire-plugin:2.19.1:test (default-test) on project torque-runtime: Execution default-test of goal org.apache.maven.plugins:maven-surefire-plugin:2.19.1:test failed: There was an error in the forked process
[ERROR] java.lang.VerifyError:
[ERROR] Expecting a stackmap frame at branch target 107
[ERROR] Exception Details:
[ERROR] Location:
[ERROR] org/apache/torque/manager/AbstractBaseManager.dispose()V @32: ifnull
[ERROR] Reason:
[ERROR] Expected stackmap frame at this location.
[ERROR] Bytecode:
[ERROR] 0x0000000: 033c 11ff ff3d b800 2e12 30b6 0034 1101
[ERROR] 0x0000010: 17b6 003a 2ab4 00c0 1101 173c 1100 003d
[ERROR] 0x0000020: c600 4b1b 1101 17a0 001c 1c11 0000 a000
[ERROR] 0x0000030: 15b8 002e 1230 b600 341b 1c04 b600 9c11
[ERROR] 0x0000040: ffff 3db8 002e 1230 b600 3411 0119 b600
[ERROR] 0x0000050: 3a2a b400 c0b6 00d3 b800 2e12 30b6 0034
[ERROR] 0x0000060: 1101 1ab6 003a 2a01 b500 c01c 9b00 15b8
[ERROR] 0x0000070: 002e 1230 b600 341b 1c03 b600 9c11 ffff
[ERROR] 0x0000080: 3db8 002e 1230 b600 3411 011d b600 3a2a
[ERROR] 0x0000090: b400 d511 011d 3c11 0000 3dc6 004b 1b11
[ERROR] 0x00000a0: 011d a000 1c1c 1100 00a0 0015 b800 2e12
[ERROR] 0x00000b0: 30b6 0034 1b1c 04b6 009c 11ff ff3d b800
[ERROR] 0x00000c0: 2e12 30b6 0034 1101 1fb6 003a 2ab4 00d5
[ERROR] 0x00000d0: b600 d8b8 002e 1230 b600 3411 0120 b600
[ERROR] 0x00000e0: 3a2a 01b5 00d5 1c9b 0015 b800 2e12 30b6
[ERROR] 0x00000f0: 0034 1b1c 03b6 009c 11ff ff3d b800 2e12
[ERROR] 0x0000100: 30b6 0034 1101 23b6 003a 2ab4 0043 b600
[ERROR] 0x0000110: d9b8 002e 1230 b600 3411 0124 b600 3a2a
[ERROR] 0x0000120: b400 48b9 00dc 0100 b800 2e12 30b6 0034
[ERROR] 0x0000130: 1101 25b6 003a b1
[ERROR] Stackmap Table:
[ERROR] same_frame_extended(@143)
[ERROR] same_frame_extended(@266)
[ERROR]
[ERROR] at java.lang.Class.getDeclaredMethods0(Native Method)
[ERROR] at java.lang.Class.privateGetDeclaredMethods(Class.java:2701)
[ERROR] at java.lang.Class.privateGetMethodRecursive(Class.java:3048)
[ERROR] at java.lang.Class.getMethod0(Class.java:3018)
[ERROR] at java.lang.Class.getMethod(Class.java:1784)
[ERROR] at org.apache.maven.surefire.util.ReflectionUtils.tryGetMethod(ReflectionUtils.java:61)
[ERROR] at org.apache.maven.surefire.common.junit3.JUnit3TestChecker.isSuiteOnly(JUnit3TestChecker.java:64)
[ERROR] at org.apache.maven.surefire.common.junit3.JUnit3TestChecker.isValidJUnit3Test(JUnit3TestChecker.java:59)
[ERROR] at org.apache.maven.surefire.common.junit3.JUnit3TestChecker.accept(JUnit3TestChecker.java:54)
[ERROR] at org.apache.maven.surefire.common.junit4.JUnit4TestChecker.accept(JUnit4TestChecker.java:52)
[ERROR] at org.apache.maven.surefire.util.DefaultScanResult.applyFilter(DefaultScanResult.java:98)
[ERROR] at org.apache.maven.surefire.junit4.JUnit4Provider.scanClassPath(JUnit4Provider.java:311)
[ERROR] at org.apache.maven.surefire.junit4.JUnit4Provider.setTestsToRun(JUnit4Provider.java:191)
[ERROR] at org.apache.maven.surefire.junit4.JUnit4Provider.invoke(JUnit4Provider.java:134)
[ERROR] at org.apache.maven.surefire.booter.ForkedBooter.invokeProviderInSameClassLoader(ForkedBooter.java:290)
[ERROR] at org.apache.maven.surefire.booter.ForkedBooter.runSuitesInProcess(ForkedBooter.java:242)
[ERROR] at org.apache.maven.surefire.booter.ForkedBooter.main(ForkedBooter.java:121)
[ERROR] -> [Help 1]
[ERROR]
[ERROR] To see the full stack trace of the errors, re-run Maven with the -e switch.
[ERROR] Re-run Maven using the -X switch to enable full debug logging.
[ERROR]
[ERROR] For more information about the errors and possible solutions, please read the following articles:
[ERROR] [Help 1] http://cwiki.apache.org/confluence/display/MAVEN/PluginExecutionException
[ERROR]
[ERROR] After correcting the problems, you can resume the build with the command
[ERROR]   mvn <goals> -rf :torque-runtime
[JENKINS] Archiving <https://builds.apache.org/job/Torque4-trunk/ws/torque4-trunk/torque-maven-plugin/pom.xml> to org.apache.torque/torque-maven-plugin/4.1-SNAPSHOT/torque-maven-plugin-4.1-SNAPSHOT.pom
[JENKINS] Archiving <https://builds.apache.org/job/Torque4-trunk/ws/torque4-trunk/pom.xml> to org.apache.torque/torque/4.1-SNAPSHOT/torque-4.1-SNAPSHOT.pom
<https://builds.apache.org/job/Torque4-trunk/ws/torque4-trunk/pom.xml> is not inside <https://builds.apache.org/job/Torque4-trunk/ws/torque4-trunk/torque4-trunk/;> will archive in a separate pass
[JENKINS] Archiving <https://builds.apache.org/job/Torque4-trunk/ws/torque4-trunk/torque-site/pom.xml> to org.apache.torque/torque-site/4.1-SNAPSHOT/torque-site-4.1-SNAPSHOT.pom
[JENKINS] Archiving <https://builds.apache.org/job/Torque4-trunk/ws/torque4-trunk/torque-generator/pom.xml> to org.apache.torque/torque-generator/4.1-SNAPSHOT/torque-generator-4.1-SNAPSHOT.pom
[JENKINS] Archiving <https://builds.apache.org/job/Torque4-trunk/ws/torque4-trunk/torque-templates/pom.xml> to org.apache.torque/torque-templates/4.1-SNAPSHOT/torque-templates-4.1-SNAPSHOT.pom
[JENKINS] Archiving <https://builds.apache.org/job/Torque4-trunk/ws/torque4-trunk/torque-runtime/pom.xml> to org.apache.torque/torque-runtime/4.1-SNAPSHOT/torque-runtime-4.1-SNAPSHOT.pom
[JENKINS] Archiving <https://builds.apache.org/job/Torque4-trunk/ws/torque4-trunk/torque-runtime/target/torque-runtime-4.1-SNAPSHOT.jar> to org.apache.torque/torque-runtime/4.1-SNAPSHOT/torque-runtime-4.1-SNAPSHOT.jar
[JENKINS] Archiving <https://builds.apache.org/job/Torque4-trunk/ws/torque4-trunk/torque-runtime/target/torque-runtime-4.1-SNAPSHOT-sources.jar> to org.apache.torque/torque-runtime/4.1-SNAPSHOT/torque-runtime-4.1-SNAPSHOT-sources.jar
[JENKINS] Archiving <https://builds.apache.org/job/Torque4-trunk/ws/torque4-trunk/torque-ant-tasks/pom.xml> to org.apache.torque/torque-ant-tasks/4.1-SNAPSHOT/torque-ant-tasks-4.1-SNAPSHOT.pom
Sending e-mails to: [hidden email]
channel stopped
[Cobertura] Publishing Cobertura coverage report...


---------------------------------------------------------------------
To unsubscribe, e-mail: [hidden email]
For additional commands, e-mail: [hidden email]

Reply | Threaded
Open this post in threaded view
|

Build failed in Jenkins: Torque4-trunk #578

Apache Jenkins Server-2
See <https://builds.apache.org/job/Torque4-trunk/578/display/redirect?page=changes>

Changes:

[gk] - update bug report, add profile to fix javadoc/java8
- update documentation

------------------------------------------
[...truncated 200.96 KB...]
Jul 03, 2018 2:58:40 PM org.apache.commons.jcs.engine.control.CompositeCacheConfigurator parseRegions
INFO: Parsed regions [testCache1]
Jul 03, 2018 2:58:40 PM org.apache.commons.jcs.engine.control.CompositeCacheManager doConfigure
INFO: Finished configuration in 48 ms.
Tests run: 3, Failures: 0, Errors: 0, Skipped: 0, Time elapsed: 0.469 sec - in org.apache.torque.manager.MethodResultCacheTest
Running org.apache.torque.manager.AbstractBaseManagerTest
Jul 03, 2018 2:58:41 PM org.apache.commons.jcs.engine.control.CompositeCacheManager getInstance
INFO: Instance is null, creating with config [/cache.ccf]
Jul 03, 2018 2:58:41 PM org.apache.commons.jcs.engine.control.CompositeCacheManager configure
INFO: Creating cache manager from config file: /cache.ccf
Jul 03, 2018 2:58:41 PM org.apache.commons.jcs.utils.threadpool.ThreadPoolManager loadConfig
INFO: thread_pool.default PoolConfiguration = useBoundary = [false] boundarySize = [2000] maximumPoolSize = [150] minimumPoolSize = [4] keepAliveTime = [300000] whenBlockedPolicy = [RUN] startUpSize = [4]
Jul 03, 2018 2:58:41 PM org.apache.commons.jcs.engine.control.CompositeCacheManager doConfigure
INFO: Setting default auxiliaries to
Jul 03, 2018 2:58:41 PM org.apache.commons.jcs.engine.control.CompositeCacheManager doConfigure
INFO: setting defaultCompositeCacheAttributes to [ useLateral = true, useRemote = true, useDisk = true, maxObjs = 1000, maxSpoolPerRun = -1, diskUsagePattern = SWAP, spoolChunkSize = 2 ]
Jul 03, 2018 2:58:41 PM org.apache.commons.jcs.engine.control.CompositeCacheConfigurator parseElementAttributes
INFO: No special ElementAttribute class defined for key [jcs.default.elementattributes], using default class.
Jul 03, 2018 2:58:41 PM org.apache.commons.jcs.engine.control.CompositeCacheManager doConfigure
INFO: setting defaultElementAttributes to [ IS_LATERAL = true, IS_SPOOL = true, IS_REMOTE = true, IS_ETERNAL = true, MaxLifeSeconds = -1, IdleTime = -1, CreateTime = 1530629921856, LastAccessTime = 1530629921856, getTimeToLiveSeconds() = -1, createTime = 1530629921856 ]
Jul 03, 2018 2:58:41 PM org.apache.commons.jcs.engine.control.CompositeCacheConfigurator parseElementAttributes
INFO: No special ElementAttribute class defined for key [jcs.region.testCache1.elementattributes], using default class.
Jul 03, 2018 2:58:41 PM org.apache.commons.jcs.engine.memory.AbstractDoubleLinkedListMemoryCache initialize
INFO: initialized MemoryCache for testCache1
Jul 03, 2018 2:58:41 PM org.apache.commons.jcs.engine.control.CompositeCache <init>
INFO: Constructed cache with name [testCache1] and cache attributes [ useLateral = true, useRemote = true, useDisk = true, maxObjs = 1000, maxSpoolPerRun = -1, diskUsagePattern = SWAP, spoolChunkSize = 2 ]
Jul 03, 2018 2:58:41 PM org.apache.commons.jcs.engine.control.CompositeCacheConfigurator parseRegions
INFO: Parsed regions [testCache1]
Jul 03, 2018 2:58:41 PM org.apache.commons.jcs.engine.control.CompositeCacheManager doConfigure
INFO: Finished configuration in 31 ms.
Tests run: 9, Failures: 0, Errors: 0, Skipped: 0, Time elapsed: 0.396 sec - in org.apache.torque.manager.AbstractBaseManagerTest
Running org.apache.torque.avalon.AvalonTest
[WARNING] Unable to find any resource with the name '/componentConfiguration.properties'
[WARNING] Unable to find any resource with the name '/parameters.properties'
[INFO] YaffiContainer ready.
[INFO] YaffiContainer has been disposed.
[WARNING] Unable to find any resource with the name '/componentConfiguration.properties'
[WARNING] Unable to find any resource with the name '/parameters.properties'
[INFO] YaffiContainer ready.
[INFO] YaffiContainer has been disposed.
Tests run: 2, Failures: 0, Errors: 0, Skipped: 0, Time elapsed: 0.313 sec - in org.apache.torque.avalon.AvalonTest
Running org.apache.torque.map.ColumnMapTest
Tests run: 3, Failures: 0, Errors: 0, Skipped: 0, Time elapsed: 0.201 sec - in org.apache.torque.map.ColumnMapTest
Running org.apache.torque.adapter.DBOracleTest
Tests run: 1, Failures: 0, Errors: 0, Skipped: 0, Time elapsed: 0.059 sec - in org.apache.torque.adapter.DBOracleTest
Running org.apache.torque.TorqueRuntimeExceptionTest
Tests run: 1, Failures: 0, Errors: 0, Skipped: 0, Time elapsed: 0.195 sec - in org.apache.torque.TorqueRuntimeExceptionTest
Running org.apache.torque.criteria.CriteriaTest
Tests run: 33, Failures: 0, Errors: 0, Skipped: 0, Time elapsed: 0.496 sec - in org.apache.torque.criteria.CriteriaTest
Running org.apache.torque.criteria.JoinTest
Tests run: 2, Failures: 0, Errors: 0, Skipped: 0, Time elapsed: 0.179 sec - in org.apache.torque.criteria.JoinTest
Running org.apache.torque.criteria.CriterionTest
Tests run: 10, Failures: 0, Errors: 0, Skipped: 0, Time elapsed: 0.186 sec - in org.apache.torque.criteria.CriterionTest
Running org.apache.torque.om.mapper.CompositeMapperTest
Tests run: 2, Failures: 0, Errors: 0, Skipped: 0, Time elapsed: 0.473 sec - in org.apache.torque.om.mapper.CompositeMapperTest
Running org.apache.torque.om.mapper.ObjectListMapperTest
Tests run: 12, Failures: 0, Errors: 0, Skipped: 0, Time elapsed: 0.663 sec - in org.apache.torque.om.mapper.ObjectListMapperTest
Running org.apache.torque.om.mapper.StringMapperTest
Tests run: 3, Failures: 0, Errors: 0, Skipped: 0, Time elapsed: 0.513 sec - in org.apache.torque.om.mapper.StringMapperTest
Running org.apache.torque.om.mapper.LongMapperTest
Tests run: 3, Failures: 0, Errors: 0, Skipped: 0, Time elapsed: 0.516 sec - in org.apache.torque.om.mapper.LongMapperTest
Running org.apache.torque.om.mapper.BigDecimalMapperTest
Tests run: 3, Failures: 0, Errors: 0, Skipped: 0, Time elapsed: 0.472 sec - in org.apache.torque.om.mapper.BigDecimalMapperTest
Running org.apache.torque.om.mapper.DateMapperTest
Tests run: 3, Failures: 0, Errors: 0, Skipped: 0, Time elapsed: 0.524 sec - in org.apache.torque.om.mapper.DateMapperTest
Running org.apache.torque.om.mapper.IntegerMapperTest
Tests run: 3, Failures: 0, Errors: 0, Skipped: 0, Time elapsed: 0.545 sec - in org.apache.torque.om.mapper.IntegerMapperTest
Running org.apache.torque.om.NumberKeyTest
Tests run: 23, Failures: 0, Errors: 0, Skipped: 0, Time elapsed: 0.048 sec - in org.apache.torque.om.NumberKeyTest
Running org.apache.torque.om.ComboKeyTest
Tests run: 9, Failures: 0, Errors: 0, Skipped: 0, Time elapsed: 0.058 sec - in org.apache.torque.om.ComboKeyTest
Running org.apache.torque.TorqueInstanceTest
Tests run: 5, Failures: 0, Errors: 0, Skipped: 0, Time elapsed: 0.214 sec - in org.apache.torque.TorqueInstanceTest

Results :

Tests run: 365, Failures: 0, Errors: 0, Skipped: 0

[JENKINS] Recording test results
[WARNING] Attempt to (de-)serialize anonymous class hudson.maven.reporters.SurefireArchiver$2; see: https://jenkins.io/redirect/serialization-of-anonymous-classes/
[WARNING] Attempt to (de-)serialize anonymous class hudson.maven.reporters.BuildInfoRecorder$1; see: https://jenkins.io/redirect/serialization-of-anonymous-classes/
[INFO]
[INFO] --- maven-jar-plugin:3.0.0:jar (default-jar) @ torque-runtime ---
[INFO] Building jar: <https://builds.apache.org/job/Torque4-trunk/ws/torque4-trunk/torque-runtime/target/torque-runtime-4.1-SNAPSHOT.jar>
[INFO]
[INFO] --- maven-site-plugin:3.5.1:attach-descriptor (attach-descriptor) @ torque-runtime ---
[INFO]
[INFO] --- maven-source-plugin:3.0.0:jar-no-fork (attach-sources) @ torque-runtime ---
[INFO] Building jar: <https://builds.apache.org/job/Torque4-trunk/ws/torque4-trunk/torque-runtime/target/torque-runtime-4.1-SNAPSHOT-sources.jar>
[INFO]
[INFO] --- apache-rat-plugin:0.11:check (default) @ torque-runtime ---
[INFO] 51 implicit excludes (use -debug for more details).
[INFO] Exclude: velocity.log
[INFO] Exclude: .checkstyle
[INFO] Exclude: checkstyle-cache.ccf
[INFO] Exclude: derby.log
[INFO] Exclude: LICENSE-EDL.txt
[INFO] Exclude: DEPENDENCIES
[INFO] Exclude: torque-test/target/**/*
[INFO] Exclude: torque-test/.classpath
[INFO] Exclude: torque-test/.project
[INFO] Exclude: torque-test/.settings/**
[INFO] Exclude: torque-test/src/main/generated-java/**/*
[INFO] Exclude: torque-test/derby.log
[INFO] 182 resources included (use -debug for more details)
[INFO] Rat check: Summary of files. Unapproved: 0 unknown: 0 generated: 0 approved: 180 licence.
[CHECKSTYLE] No report found for mojo check
[PMD] No report found for mojo check
[INFO]
[INFO] --- maven-install-plugin:2.5.2:install (default-install) @ torque-runtime ---
[INFO] Installing <https://builds.apache.org/job/Torque4-trunk/ws/torque4-trunk/torque-runtime/target/torque-runtime-4.1-SNAPSHOT.jar> to /home/jenkins/jenkins-slave/maven-repositories/0/org/apache/torque/torque-runtime/4.1-SNAPSHOT/torque-runtime-4.1-SNAPSHOT.jar
[INFO] Installing <https://builds.apache.org/job/Torque4-trunk/ws/torque4-trunk/torque-runtime/pom.xml> to /home/jenkins/jenkins-slave/maven-repositories/0/org/apache/torque/torque-runtime/4.1-SNAPSHOT/torque-runtime-4.1-SNAPSHOT.pom
[INFO] Installing <https://builds.apache.org/job/Torque4-trunk/ws/torque4-trunk/torque-runtime/target/torque-runtime-4.1-SNAPSHOT-sources.jar> to /home/jenkins/jenkins-slave/maven-repositories/0/org/apache/torque/torque-runtime/4.1-SNAPSHOT/torque-runtime-4.1-SNAPSHOT-sources.jar
[INFO]
[INFO] >>> cobertura-maven-plugin:2.3:cobertura (default-cli) > [cobertura]test @ torque-runtime >>>
[INFO]
[INFO] --- maven-remote-resources-plugin:1.5:process (process-resource-bundles) @ torque-runtime ---
[INFO]
[INFO] --- maven-resources-plugin:2.7:resources (default-resources) @ torque-runtime ---
[INFO] Using 'ISO-8859-1' encoding to copy filtered resources.
[INFO] skip non existing resourceDirectory <https://builds.apache.org/job/Torque4-trunk/ws/torque4-trunk/torque-runtime/src/main/resources>
[INFO] Copying 3 resources
[INFO] Copying 3 resources
[INFO]
[INFO] --- maven-compiler-plugin:3.5.1:compile (default-compile) @ torque-runtime ---
[INFO] Nothing to compile - all classes are up to date
[INFO]
[INFO] --- cobertura-maven-plugin:2.3:instrument (default-cli) @ torque-runtime ---
[INFO] Cobertura 1.9.2 - GNU GPL License (NO WARRANTY) - See COPYRIGHT file
Instrumenting 122 files to <https://builds.apache.org/job/Torque4-trunk/ws/torque4-trunk/torque-runtime/target/generated-classes/cobertura>
Cobertura: Saved information on 122 classes.
Instrument time: 496ms

[INFO] Instrumentation was successful.
[INFO]
[INFO] --- maven-resources-plugin:2.7:testResources (default-testResources) @ torque-runtime ---
[INFO] Using 'ISO-8859-1' encoding to copy filtered resources.
[INFO] Copying 5 resources
[INFO] Copying 3 resources
[INFO] Copying 3 resources
[INFO]
[INFO] --- maven-compiler-plugin:3.5.1:testCompile (default-testCompile) @ torque-runtime ---
[INFO] Nothing to compile - all classes are up to date
[INFO]
[INFO] --- maven-surefire-plugin:2.19.1:test (default-test) @ torque-runtime ---

-------------------------------------------------------
 T E S T S
-------------------------------------------------------

Results :

Tests run: 0, Failures: 0, Errors: 0, Skipped: 0

[JENKINS] Recording test results
[INFO] ------------------------------------------------------------------------
[INFO] Reactor Summary:
[INFO]
[INFO] Torque Maven Parent ................................ SUCCESS [01:19 min]
[INFO] Torque Runtime ..................................... FAILURE [ 54.416 s]
[INFO] Torque Generator ................................... SKIPPED
[INFO] Torque Templates ................................... SKIPPED
[INFO] Torque Generator Maven 2 Plugin .................... SKIPPED
[INFO] Torque Generator Ant tasks ......................... SKIPPED
[INFO] Torque Site ........................................ SKIPPED
[INFO] ------------------------------------------------------------------------
[INFO] BUILD FAILURE
[INFO] ------------------------------------------------------------------------
[INFO] Total time: 02:31 min
[INFO] Finished at: 2018-07-03T14:59:24Z
[INFO] Final Memory: 61M/649M
[INFO] ------------------------------------------------------------------------
Waiting for Jenkins to finish collecting data
[ERROR] Failed to execute goal org.apache.maven.plugins:maven-surefire-plugin:2.19.1:test (default-test) on project torque-runtime: Execution default-test of goal org.apache.maven.plugins:maven-surefire-plugin:2.19.1:test failed: There was an error in the forked process
[ERROR] java.lang.VerifyError:
[ERROR] Expecting a stackmap frame at branch target 107
[ERROR] Exception Details:
[ERROR] Location:
[ERROR] org/apache/torque/manager/AbstractBaseManager.getOMInstance(Lorg/apache/torque/om/ObjectKey;Z)Lorg/apache/torque/om/Persistent; @48: ifeq
[ERROR] Reason:
[ERROR] Expected stackmap frame at this location.
[ERROR] Bytecode:
[ERROR] 0x0000000: 033e 11ff ff36 04b8 002e 1230 b600 3411
[ERROR] 0x0000010: 00d7 b600 3a01 3a05 b800 2e12 30b6 0034
[ERROR] 0x0000020: 1100 d8b6 003a 1c11 00d8 3e11 0000 3604
[ERROR] 0x0000030: 9900 3b1d 1100 d8a0 001f 1504 1100 00a0
[ERROR] 0x0000040: 0017 b800 2e12 30b6 0034 1d15 0404 b600
[ERROR] 0x0000050: 9c11 ffff 3604 b800 2e12 30b6 0034 1100
[ERROR] 0x0000060: dab6 003a 2a2b b600 b23a 0515 049b 0017
[ERROR] 0x0000070: b800 2e12 30b6 0034 1d15 0403 b600 9c11
[ERROR] 0x0000080: ffff 3604 b800 2e12 30b6 0034 1100 ddb6
[ERROR] 0x0000090: 003a 1905 1100 dd3e 1100 0036 04c7 008e
[ERROR] 0x00000a0: 1d11 00dd a000 1f15 0411 0000 a000 17b8
[ERROR] 0x00000b0: 002e 1230 b600 341d 1504 04b6 009c 11ff
[ERROR] 0x00000c0: ff36 04b8 002e 1230 b600 3411 00df b600
[ERROR] 0x00000d0: 3a2a 2bb6 00b5 3a05 b800 2e12 30b6 0034
[ERROR] 0x00000e0: 1100 e0b6 003a 1c11 00e0 3e11 0000 3604
[ERROR] 0x00000f0: 9900 3b1d 1100 e0a0 001f 1504 1100 00a0
[ERROR] 0x0000100: 0017 b800 2e12 30b6 0034 1d15 0404 b600
[ERROR] 0x0000110: 9c11 ffff 3604 b800 2e12 30b6 0034 1100
[ERROR] 0x0000120: e2b6 003a 2a19 05b6 00b9 5715 049b 0017
[ERROR] 0x0000130: b800 2e12 30b6 0034 1d15 0403 b600 9c11
[ERROR] 0x0000140: ffff 3604 b800 2e12 30b6 0034 1100 e6b6
[ERROR] 0x0000150: 003a 1905 b0
[ERROR] Stackmap Table:
[ERROR] append_frame(@146,Object[#114])
[ERROR] same_frame_extended(@338)
[ERROR]
[ERROR] at java.lang.Class.getDeclaredMethods0(Native Method)
[ERROR] at java.lang.Class.privateGetDeclaredMethods(Class.java:2701)
[ERROR] at java.lang.Class.privateGetMethodRecursive(Class.java:3048)
[ERROR] at java.lang.Class.getMethod0(Class.java:3018)
[ERROR] at java.lang.Class.getMethod(Class.java:1784)
[ERROR] at org.apache.maven.surefire.util.ReflectionUtils.tryGetMethod(ReflectionUtils.java:61)
[ERROR] at org.apache.maven.surefire.common.junit3.JUnit3TestChecker.isSuiteOnly(JUnit3TestChecker.java:64)
[ERROR] at org.apache.maven.surefire.common.junit3.JUnit3TestChecker.isValidJUnit3Test(JUnit3TestChecker.java:59)
[ERROR] at org.apache.maven.surefire.common.junit3.JUnit3TestChecker.accept(JUnit3TestChecker.java:54)
[ERROR] at org.apache.maven.surefire.common.junit4.JUnit4TestChecker.accept(JUnit4TestChecker.java:52)
[ERROR] at org.apache.maven.surefire.util.DefaultScanResult.applyFilter(DefaultScanResult.java:98)
[ERROR] at org.apache.maven.surefire.junit4.JUnit4Provider.scanClassPath(JUnit4Provider.java:311)
[ERROR] at org.apache.maven.surefire.junit4.JUnit4Provider.setTestsToRun(JUnit4Provider.java:191)
[ERROR] at org.apache.maven.surefire.junit4.JUnit4Provider.invoke(JUnit4Provider.java:134)
[ERROR] at org.apache.maven.surefire.booter.ForkedBooter.invokeProviderInSameClassLoader(ForkedBooter.java:290)
[ERROR] at org.apache.maven.surefire.booter.ForkedBooter.runSuitesInProcess(ForkedBooter.java:242)
[ERROR] at org.apache.maven.surefire.booter.ForkedBooter.main(ForkedBooter.java:121)
[ERROR] -> [Help 1]
[ERROR]
[ERROR] To see the full stack trace of the errors, re-run Maven with the -e switch.
[ERROR] Re-run Maven using the -X switch to enable full debug logging.
[ERROR]
[ERROR] For more information about the errors and possible solutions, please read the following articles:
[ERROR] [Help 1] http://cwiki.apache.org/confluence/display/MAVEN/PluginExecutionException
[ERROR]
[ERROR] After correcting the problems, you can resume the build with the command
[ERROR]   mvn <goals> -rf :torque-runtime
[JENKINS] Archiving <https://builds.apache.org/job/Torque4-trunk/ws/torque4-trunk/torque-maven-plugin/pom.xml> to org.apache.torque/torque-maven-plugin/4.1-SNAPSHOT/torque-maven-plugin-4.1-SNAPSHOT.pom
[JENKINS] Archiving <https://builds.apache.org/job/Torque4-trunk/ws/torque4-trunk/pom.xml> to org.apache.torque/torque/4.1-SNAPSHOT/torque-4.1-SNAPSHOT.pom
<https://builds.apache.org/job/Torque4-trunk/ws/torque4-trunk/pom.xml> is not inside <https://builds.apache.org/job/Torque4-trunk/ws/torque4-trunk/torque4-trunk/;> will archive in a separate pass
[JENKINS] Archiving <https://builds.apache.org/job/Torque4-trunk/ws/torque4-trunk/torque-site/pom.xml> to org.apache.torque/torque-site/4.1-SNAPSHOT/torque-site-4.1-SNAPSHOT.pom
[JENKINS] Archiving <https://builds.apache.org/job/Torque4-trunk/ws/torque4-trunk/torque-generator/pom.xml> to org.apache.torque/torque-generator/4.1-SNAPSHOT/torque-generator-4.1-SNAPSHOT.pom
[JENKINS] Archiving <https://builds.apache.org/job/Torque4-trunk/ws/torque4-trunk/torque-templates/pom.xml> to org.apache.torque/torque-templates/4.1-SNAPSHOT/torque-templates-4.1-SNAPSHOT.pom
[JENKINS] Archiving <https://builds.apache.org/job/Torque4-trunk/ws/torque4-trunk/torque-runtime/pom.xml> to org.apache.torque/torque-runtime/4.1-SNAPSHOT/torque-runtime-4.1-SNAPSHOT.pom
[JENKINS] Archiving <https://builds.apache.org/job/Torque4-trunk/ws/torque4-trunk/torque-runtime/target/torque-runtime-4.1-SNAPSHOT.jar> to org.apache.torque/torque-runtime/4.1-SNAPSHOT/torque-runtime-4.1-SNAPSHOT.jar
[JENKINS] Archiving <https://builds.apache.org/job/Torque4-trunk/ws/torque4-trunk/torque-runtime/target/torque-runtime-4.1-SNAPSHOT-sources.jar> to org.apache.torque/torque-runtime/4.1-SNAPSHOT/torque-runtime-4.1-SNAPSHOT-sources.jar
[JENKINS] Archiving <https://builds.apache.org/job/Torque4-trunk/ws/torque4-trunk/torque-ant-tasks/pom.xml> to org.apache.torque/torque-ant-tasks/4.1-SNAPSHOT/torque-ant-tasks-4.1-SNAPSHOT.pom
Sending e-mails to: [hidden email]
channel stopped
[Cobertura] Publishing Cobertura coverage report...


---------------------------------------------------------------------
To unsubscribe, e-mail: [hidden email]
For additional commands, e-mail: [hidden email]

Reply | Threaded
Open this post in threaded view
|

Build failed in Jenkins: Torque4-trunk #579

Apache Jenkins Server-2
See <https://builds.apache.org/job/Torque4-trunk/579/display/redirect?page=changes>

Changes:

[gk] TORQUE-352 and fixed current OWASP issues (upgrading or ignoring as false positive)

------------------------------------------
[...truncated 218.14 KB...]
Running org.apache.torque.om.mapper.StringMapperTest
Tests run: 3, Failures: 0, Errors: 0, Skipped: 0, Time elapsed: 0.432 sec - in org.apache.torque.om.mapper.StringMapperTest
Running org.apache.torque.om.mapper.LongMapperTest
Tests run: 3, Failures: 0, Errors: 0, Skipped: 0, Time elapsed: 0.567 sec - in org.apache.torque.om.mapper.LongMapperTest
Running org.apache.torque.om.NumberKeyTest
Tests run: 23, Failures: 0, Errors: 0, Skipped: 0, Time elapsed: 0.06 sec - in org.apache.torque.om.NumberKeyTest
Running org.apache.torque.avalon.AvalonTest
[WARNING] Unable to find any resource with the name '/componentConfiguration.properties'
[WARNING] Unable to find any resource with the name '/parameters.properties'
[INFO] YaffiContainer ready.
[INFO] YaffiContainer has been disposed.
[WARNING] Unable to find any resource with the name '/componentConfiguration.properties'
[WARNING] Unable to find any resource with the name '/parameters.properties'
[INFO] YaffiContainer ready.
[INFO] YaffiContainer has been disposed.
Tests run: 2, Failures: 0, Errors: 0, Skipped: 0, Time elapsed: 0.353 sec - in org.apache.torque.avalon.AvalonTest
Running org.apache.torque.util.functions.MaxTest
Tests run: 4, Failures: 0, Errors: 0, Skipped: 0, Time elapsed: 0.037 sec - in org.apache.torque.util.functions.MaxTest
Running org.apache.torque.util.functions.AggregateFunctionTest
Tests run: 12, Failures: 0, Errors: 0, Skipped: 0, Time elapsed: 0.058 sec - in org.apache.torque.util.functions.AggregateFunctionTest
Running org.apache.torque.util.functions.AbstractFunctionTest
Tests run: 11, Failures: 0, Errors: 0, Skipped: 0, Time elapsed: 0.054 sec - in org.apache.torque.util.functions.AbstractFunctionTest
Running org.apache.torque.util.functions.MinTest
Tests run: 4, Failures: 0, Errors: 0, Skipped: 0, Time elapsed: 0.053 sec - in org.apache.torque.util.functions.MinTest
Running org.apache.torque.util.functions.SumTest
Tests run: 4, Failures: 0, Errors: 0, Skipped: 0, Time elapsed: 0.057 sec - in org.apache.torque.util.functions.SumTest
Running org.apache.torque.util.functions.AvgTest
Tests run: 4, Failures: 0, Errors: 0, Skipped: 0, Time elapsed: 0.056 sec - in org.apache.torque.util.functions.AvgTest
Running org.apache.torque.util.functions.CountTest
Tests run: 4, Failures: 0, Errors: 0, Skipped: 0, Time elapsed: 0.051 sec - in org.apache.torque.util.functions.CountTest
Running org.apache.torque.util.BasePeerImplTest
Tests run: 16, Failures: 0, Errors: 0, Skipped: 0, Time elapsed: 0.681 sec - in org.apache.torque.util.BasePeerImplTest
Running org.apache.torque.util.UniqueListTest
Tests run: 2, Failures: 0, Errors: 0, Skipped: 0, Time elapsed: 0.041 sec - in org.apache.torque.util.UniqueListTest
Running org.apache.torque.util.SummaryHelperTest
Tests run: 1, Failures: 0, Errors: 0, Skipped: 0, Time elapsed: 0.609 sec - in org.apache.torque.util.SummaryHelperTest
Running org.apache.torque.ColumnImplTest
Tests run: 41, Failures: 0, Errors: 0, Skipped: 0, Time elapsed: 0.3 sec - in org.apache.torque.ColumnImplTest
Running org.apache.torque.map.ColumnMapTest
Tests run: 3, Failures: 0, Errors: 0, Skipped: 0, Time elapsed: 0.192 sec - in org.apache.torque.map.ColumnMapTest
Running org.apache.torque.sql.QueryTest
Tests run: 2, Failures: 0, Errors: 0, Skipped: 0, Time elapsed: 0.179 sec - in org.apache.torque.sql.QueryTest
Running org.apache.torque.sql.SqlBuilderTest
Tests run: 130, Failures: 0, Errors: 0, Skipped: 0, Time elapsed: 0.615 sec - in org.apache.torque.sql.SqlBuilderTest

Results :

Tests run: 365, Failures: 0, Errors: 0, Skipped: 0

[JENKINS] Recording test results
[WARNING] Attempt to (de-)serialize anonymous class hudson.maven.reporters.SurefireArchiver$2; see: https://jenkins.io/redirect/serialization-of-anonymous-classes/
[WARNING] Attempt to (de-)serialize anonymous class hudson.maven.reporters.BuildInfoRecorder$1; see: https://jenkins.io/redirect/serialization-of-anonymous-classes/
[INFO]
[INFO] --- maven-jar-plugin:3.0.0:jar (default-jar) @ torque-runtime ---
[INFO] Building jar: <https://builds.apache.org/job/Torque4-trunk/ws/torque4-trunk/torque-runtime/target/torque-runtime-4.1-SNAPSHOT.jar>
[INFO]
[INFO] --- maven-site-plugin:3.5.1:attach-descriptor (attach-descriptor) @ torque-runtime ---
[INFO]
[INFO] --- maven-source-plugin:3.0.0:jar-no-fork (attach-sources) @ torque-runtime ---
[INFO] Building jar: <https://builds.apache.org/job/Torque4-trunk/ws/torque4-trunk/torque-runtime/target/torque-runtime-4.1-SNAPSHOT-sources.jar>
[INFO]
[INFO] --- apache-rat-plugin:0.11:check (default) @ torque-runtime ---
[INFO] 51 implicit excludes (use -debug for more details).
[INFO] Exclude: velocity.log
[INFO] Exclude: .checkstyle
[INFO] Exclude: checkstyle-cache.ccf
[INFO] Exclude: derby.log
[INFO] Exclude: LICENSE-EDL.txt
[INFO] Exclude: DEPENDENCIES
[INFO] Exclude: torque-test/target/**/*
[INFO] Exclude: torque-test/.classpath
[INFO] Exclude: torque-test/.project
[INFO] Exclude: torque-test/.settings/**
[INFO] Exclude: torque-test/src/main/generated-java/**/*
[INFO] Exclude: torque-test/derby.log
[INFO] 182 resources included (use -debug for more details)
[INFO] Rat check: Summary of files. Unapproved: 0 unknown: 0 generated: 0 approved: 180 licence.
[CHECKSTYLE] No report found for mojo check
[PMD] No report found for mojo check
[INFO]
[INFO] --- dependency-check-maven:3.1.2:check (default) @ torque-runtime ---
[INFO] Skipping dependency-check
[CHECKSTYLE] No report found for mojo check
[PMD] No report found for mojo check
[INFO]
[INFO] --- maven-install-plugin:2.5.2:install (default-install) @ torque-runtime ---
[INFO] Installing <https://builds.apache.org/job/Torque4-trunk/ws/torque4-trunk/torque-runtime/target/torque-runtime-4.1-SNAPSHOT.jar> to /home/jenkins/jenkins-slave/maven-repositories/1/org/apache/torque/torque-runtime/4.1-SNAPSHOT/torque-runtime-4.1-SNAPSHOT.jar
[INFO] Installing <https://builds.apache.org/job/Torque4-trunk/ws/torque4-trunk/torque-runtime/pom.xml> to /home/jenkins/jenkins-slave/maven-repositories/1/org/apache/torque/torque-runtime/4.1-SNAPSHOT/torque-runtime-4.1-SNAPSHOT.pom
[INFO] Installing <https://builds.apache.org/job/Torque4-trunk/ws/torque4-trunk/torque-runtime/target/torque-runtime-4.1-SNAPSHOT-sources.jar> to /home/jenkins/jenkins-slave/maven-repositories/1/org/apache/torque/torque-runtime/4.1-SNAPSHOT/torque-runtime-4.1-SNAPSHOT-sources.jar
[INFO]
[INFO] >>> cobertura-maven-plugin:2.3:cobertura (default-cli) > [cobertura]test @ torque-runtime >>>
[INFO]
[INFO] --- maven-remote-resources-plugin:1.5:process (process-resource-bundles) @ torque-runtime ---
[INFO]
[INFO] --- maven-resources-plugin:2.7:resources (default-resources) @ torque-runtime ---
[INFO] Using 'ISO-8859-1' encoding to copy filtered resources.
[INFO] skip non existing resourceDirectory <https://builds.apache.org/job/Torque4-trunk/ws/torque4-trunk/torque-runtime/src/main/resources>
[INFO] Copying 3 resources
[INFO] Copying 3 resources
[INFO]
[INFO] --- maven-compiler-plugin:3.5.1:compile (default-compile) @ torque-runtime ---
[INFO] Nothing to compile - all classes are up to date
[INFO]
[INFO] --- cobertura-maven-plugin:2.3:instrument (default-cli) @ torque-runtime ---
[INFO] Cobertura 1.9.2 - GNU GPL License (NO WARRANTY) - See COPYRIGHT file
Instrumenting 122 files to <https://builds.apache.org/job/Torque4-trunk/ws/torque4-trunk/torque-runtime/target/generated-classes/cobertura>
Cobertura: Saved information on 122 classes.
Instrument time: 530ms

[INFO] Instrumentation was successful.
[INFO]
[INFO] --- maven-resources-plugin:2.7:testResources (default-testResources) @ torque-runtime ---
[INFO] Using 'ISO-8859-1' encoding to copy filtered resources.
[INFO] Copying 5 resources
[INFO] Copying 3 resources
[INFO] Copying 3 resources
[INFO]
[INFO] --- maven-compiler-plugin:3.5.1:testCompile (default-testCompile) @ torque-runtime ---
[INFO] Nothing to compile - all classes are up to date
[INFO]
[INFO] --- maven-surefire-plugin:2.19.1:test (default-test) @ torque-runtime ---

-------------------------------------------------------
 T E S T S
-------------------------------------------------------

Results :

Tests run: 0, Failures: 0, Errors: 0, Skipped: 0

[JENKINS] Recording test results
[INFO] ------------------------------------------------------------------------
[INFO] Reactor Summary:
[INFO]
[INFO] Torque Maven Parent 4.1-SNAPSHOT ................... SUCCESS [01:20 min]
[INFO] Torque Runtime ..................................... FAILURE [ 56.910 s]
[INFO] Torque Generator ................................... SKIPPED
[INFO] Torque Templates ................................... SKIPPED
[INFO] Torque Generator Maven 2 Plugin .................... SKIPPED
[INFO] Torque Generator Ant tasks ......................... SKIPPED
[INFO] Torque Site 4.1-SNAPSHOT ........................... SKIPPED
[INFO] ------------------------------------------------------------------------
[INFO] BUILD FAILURE
[INFO] ------------------------------------------------------------------------
[INFO] Total time: 02:35 min
[INFO] Finished at: 2018-08-15T13:26:11Z
[INFO] ------------------------------------------------------------------------
Waiting for Jenkins to finish collecting data
[ERROR] Failed to execute goal org.apache.maven.plugins:maven-surefire-plugin:2.19.1:test (default-test) on project torque-runtime: Execution default-test of goal org.apache.maven.plugins:maven-surefire-plugin:2.19.1:test failed: There was an error in the forked process
[ERROR] java.lang.VerifyError:
[ERROR] Expecting a stackmap frame at branch target 449
[ERROR] Exception Details:
[ERROR] Location:
[ERROR] org/apache/torque/manager/AbstractBaseManager.setRegion(Ljava/lang/String;)V @25: invokestatic
[ERROR] Reason:
[ERROR] Expected stackmap frame at this location.
[ERROR] Bytecode:
[ERROR] 0x0000000: 033d 11ff ff3e b800 2e12 30b6 0034 1101
[ERROR] 0x0000010: eab6 003a 2a2b b501 44b8 002e 1230 b600
[ERROR] 0x0000020: 3411 01ed b600 3ab8 014b 1301 4d03 b901
[ERROR] 0x0000030: 5303 0011 01ed 3d11 0000 3e99 0145 1c11
[ERROR] 0x0000040: 01ed a000 1c1d 1100 00a0 0015 b800 2e12
[ERROR] 0x0000050: 30b6 0034 1c1d 04b6 009c 11ff ff3e b800
[ERROR] 0x0000060: 2e12 30b6 0034 1101 efb6 003a 2ab4 00c0
[ERROR] 0x0000070: 1101 ef3d 1100 003e c600 381c 1101 efa0
[ERROR] 0x0000080: 001c 1d11 0000 a000 15b8 002e 1230 b600
[ERROR] 0x0000090: 341c 1d04 b600 9c11 ffff 3eb8 002e 1230
[ERROR] 0x00000a0: b600 3411 01f1 b600 3a2a b400 c0b6 00d3
[ERROR] 0x00000b0: 1d9b 0015 b800 2e12 30b6 0034 1c1d 03b6
[ERROR] 0x00000c0: 009c 11ff ff3e b800 2e12 30b6 0034 1101
[ERROR] 0x00000d0: f3b6 003a 2ab4 00d5 1101 f33d 1100 003e
[ERROR] 0x00000e0: c600 381c 1101 f3a0 001c 1d11 0000 a000
[ERROR] 0x00000f0: 15b8 002e 1230 b600 341c 1d04 b600 9c11
[ERROR] 0x0000100: ffff 3eb8 002e 1230 b600 3411 01f5 b600
[ERROR] 0x0000110: 3a2a b400 d5b6 00d8 1d9b 0015 b800 2e12
[ERROR] 0x0000120: 30b6 0034 1c1d 03b6 009c 11ff ff3e b800
[ERROR] 0x0000130: 2e12 30b6 0034 1101 f7b6 003a 2a2a b601
[ERROR] 0x0000140: 55b8 015b b500 c0b8 002e 1230 b600 3411
[ERROR] 0x0000150: 01f9 b600 3a2a 2ab6 0155 b801 5fb5 00d5
[ERROR] 0x0000160: b800 2e12 30b6 0034 1101 fab6 003a 2abb
[ERROR] 0x0000170: 0161 592a b400 d5b7 0164 b501 66a7 0033
[ERROR] 0x0000180: 1d9b 0015 b800 2e12 30b6 0034 1c1d 03b6
[ERROR] 0x0000190: 009c 11ff ff3e b800 2e12 30b6 0034 1101
[ERROR] 0x00001a0: feb6 003a 2abb 0168 5901 b701 69b5 0166
[ERROR] 0x00001b0: b800 2e12 30b6 0034 1102 04b6 003a a700
[ERROR] 0x00001c0: 2eb8 002e 1230 b600 3411 0201 b600 3a3a
[ERROR] 0x00001d0: 04b8 002e 1230 b600 3411 0203 b600 3abb
[ERROR] 0x00001e0: 0066 5913 016b 1904 b700 85bf b800 2e12
[ERROR] 0x00001f0: 30b6 0034 1102 06b6 003a 2ab4 00c0 1102
[ERROR] 0x0000200: 063d 1100 003e c700 4d1c 1102 06a0 001c
[ERROR] 0x0000210: 1d11 0000 a000 15b8 002e 1230 b600 341c
[ERROR] 0x0000220: 1d04 b600 9c11 ffff 3eb8 002e 1230 b600
[ERROR] 0x0000230: 3411 0208 b600 3ab2 016d bb00 7459 b700
[ERROR] 0x0000240: 7513 016f b600 7b2b b600 7bb6 0082 b901
[ERROR] 0x0000250: 7402 001d 9b00 15b8 002e 1230 b600 341c
[ERROR] 0x0000260: 1d03 b600 9c11 ffff 3eb8 002e 1230 b600
[ERROR] 0x0000270: 3411 020a b600 3ab1
[ERROR] Exception Handler Table:
[ERROR] bci [25, 432] => handler: 449
[ERROR] Stackmap Table:
[ERROR] same_frame_extended(@212)
[ERROR] same_frame_extended(@316)
[ERROR] same_frame_extended(@420)
[ERROR] same_frame(@446)
[ERROR] same_locals_1_stack_item_frame(@463,Object[#201])
[ERROR] same_frame(@506)
[ERROR] same_frame_extended(@631)
[ERROR]
[ERROR] at java.lang.Class.getDeclaredMethods0(Native Method)
[ERROR] at java.lang.Class.privateGetDeclaredMethods(Class.java:2701)
[ERROR] at java.lang.Class.privateGetMethodRecursive(Class.java:3048)
[ERROR] at java.lang.Class.getMethod0(Class.java:3018)
[ERROR] at java.lang.Class.getMethod(Class.java:1784)
[ERROR] at org.apache.maven.surefire.util.ReflectionUtils.tryGetMethod(ReflectionUtils.java:61)
[ERROR] at org.apache.maven.surefire.common.junit3.JUnit3TestChecker.isSuiteOnly(JUnit3TestChecker.java:64)
[ERROR] at org.apache.maven.surefire.common.junit3.JUnit3TestChecker.isValidJUnit3Test(JUnit3TestChecker.java:59)
[ERROR] at org.apache.maven.surefire.common.junit3.JUnit3TestChecker.accept(JUnit3TestChecker.java:54)
[ERROR] at org.apache.maven.surefire.common.junit4.JUnit4TestChecker.accept(JUnit4TestChecker.java:52)
[ERROR] at org.apache.maven.surefire.util.DefaultScanResult.applyFilter(DefaultScanResult.java:98)
[ERROR] at org.apache.maven.surefire.junit4.JUnit4Provider.scanClassPath(JUnit4Provider.java:311)
[ERROR] at org.apache.maven.surefire.junit4.JUnit4Provider.setTestsToRun(JUnit4Provider.java:191)
[ERROR] at org.apache.maven.surefire.junit4.JUnit4Provider.invoke(JUnit4Provider.java:134)
[ERROR] at org.apache.maven.surefire.booter.ForkedBooter.invokeProviderInSameClassLoader(ForkedBooter.java:290)
[ERROR] at org.apache.maven.surefire.booter.ForkedBooter.runSuitesInProcess(ForkedBooter.java:242)
[ERROR] at org.apache.maven.surefire.booter.ForkedBooter.main(ForkedBooter.java:121)
[ERROR] -> [Help 1]
[ERROR]
[ERROR] To see the full stack trace of the errors, re-run Maven with the -e switch.
[ERROR] Re-run Maven using the -X switch to enable full debug logging.
[ERROR]
[ERROR] For more information about the errors and possible solutions, please read the following articles:
[ERROR] [Help 1] http://cwiki.apache.org/confluence/display/MAVEN/PluginExecutionException
[ERROR]
[ERROR] After correcting the problems, you can resume the build with the command
[ERROR]   mvn <goals> -rf :torque-runtime
[JENKINS] Archiving <https://builds.apache.org/job/Torque4-trunk/ws/torque4-trunk/torque-maven-plugin/pom.xml> to org.apache.torque/torque-maven-plugin/4.1-SNAPSHOT/torque-maven-plugin-4.1-SNAPSHOT.pom
[JENKINS] Archiving <https://builds.apache.org/job/Torque4-trunk/ws/torque4-trunk/pom.xml> to org.apache.torque/torque/4.1-SNAPSHOT/torque-4.1-SNAPSHOT.pom
<https://builds.apache.org/job/Torque4-trunk/ws/torque4-trunk/pom.xml> is not inside <https://builds.apache.org/job/Torque4-trunk/ws/torque4-trunk/torque4-trunk/;> will archive in a separate pass
[JENKINS] Archiving <https://builds.apache.org/job/Torque4-trunk/ws/torque4-trunk/torque-site/pom.xml> to org.apache.torque/torque-site/4.1-SNAPSHOT/torque-site-4.1-SNAPSHOT.pom
[JENKINS] Archiving <https://builds.apache.org/job/Torque4-trunk/ws/torque4-trunk/torque-generator/pom.xml> to org.apache.torque/torque-generator/4.1-SNAPSHOT/torque-generator-4.1-SNAPSHOT.pom
[JENKINS] Archiving <https://builds.apache.org/job/Torque4-trunk/ws/torque4-trunk/torque-templates/pom.xml> to org.apache.torque/torque-templates/4.1-SNAPSHOT/torque-templates-4.1-SNAPSHOT.pom
[JENKINS] Archiving <https://builds.apache.org/job/Torque4-trunk/ws/torque4-trunk/torque-runtime/pom.xml> to org.apache.torque/torque-runtime/4.1-SNAPSHOT/torque-runtime-4.1-SNAPSHOT.pom
[JENKINS] Archiving <https://builds.apache.org/job/Torque4-trunk/ws/torque4-trunk/torque-runtime/target/torque-runtime-4.1-SNAPSHOT.jar> to org.apache.torque/torque-runtime/4.1-SNAPSHOT/torque-runtime-4.1-SNAPSHOT.jar
[JENKINS] Archiving <https://builds.apache.org/job/Torque4-trunk/ws/torque4-trunk/torque-runtime/target/torque-runtime-4.1-SNAPSHOT-sources.jar> to org.apache.torque/torque-runtime/4.1-SNAPSHOT/torque-runtime-4.1-SNAPSHOT-sources.jar
[JENKINS] Archiving <https://builds.apache.org/job/Torque4-trunk/ws/torque4-trunk/torque-ant-tasks/pom.xml> to org.apache.torque/torque-ant-tasks/4.1-SNAPSHOT/torque-ant-tasks-4.1-SNAPSHOT.pom
Sending e-mails to: [hidden email]
channel stopped
[Cobertura] Publishing Cobertura coverage report...


---------------------------------------------------------------------
To unsubscribe, e-mail: [hidden email]
For additional commands, e-mail: [hidden email]

Reply | Threaded
Open this post in threaded view
|

Build failed in Jenkins: Torque4-trunk #580

Apache Jenkins Server-2
See <https://builds.apache.org/job/Torque4-trunk/580/display/redirect?page=changes>

Changes:

[tv] Handle warnings

[tv] Properties modified

------------------------------------------
[...truncated 206.72 KB...]
Aug 16, 2018 8:53:10 AM org.apache.commons.jcs.engine.control.CompositeCacheConfigurator parseElementAttributes
INFO: No special ElementAttribute class defined for key [jcs.default.elementattributes], using default class.
Aug 16, 2018 8:53:10 AM org.apache.commons.jcs.engine.control.CompositeCacheManager doConfigure
INFO: setting defaultElementAttributes to [ IS_LATERAL = true, IS_SPOOL = true, IS_REMOTE = true, IS_ETERNAL = true, MaxLifeSeconds = -1, IdleTime = -1, CreateTime = 1534409590373, LastAccessTime = 1534409590373, getTimeToLiveSeconds() = -1, createTime = 1534409590373 ]
Aug 16, 2018 8:53:10 AM org.apache.commons.jcs.engine.control.CompositeCacheConfigurator parseElementAttributes
INFO: No special ElementAttribute class defined for key [jcs.region.testCache1.elementattributes], using default class.
Aug 16, 2018 8:53:10 AM org.apache.commons.jcs.engine.memory.AbstractDoubleLinkedListMemoryCache initialize
INFO: initialized MemoryCache for testCache1
Aug 16, 2018 8:53:10 AM org.apache.commons.jcs.engine.control.CompositeCache <init>
INFO: Constructed cache with name [testCache1] and cache attributes [ useLateral = true, useRemote = true, useDisk = true, maxObjs = 1000, maxSpoolPerRun = -1, diskUsagePattern = SWAP, spoolChunkSize = 2 ]
Aug 16, 2018 8:53:10 AM org.apache.commons.jcs.engine.control.CompositeCacheConfigurator parseRegions
INFO: Parsed regions [testCache1]
Aug 16, 2018 8:53:10 AM org.apache.commons.jcs.engine.control.CompositeCacheManager doConfigure
INFO: Finished configuration in 31 ms.
Tests run: 9, Failures: 0, Errors: 0, Skipped: 0, Time elapsed: 0.354 sec - in org.apache.torque.manager.AbstractBaseManagerTest
Running org.apache.torque.manager.MethodResultCacheTest
Aug 16, 2018 8:53:11 AM org.apache.commons.jcs.engine.control.CompositeCacheManager getInstance
INFO: Instance is null, creating with config [/cache.ccf]
Aug 16, 2018 8:53:11 AM org.apache.commons.jcs.engine.control.CompositeCacheManager configure
INFO: Creating cache manager from config file: /cache.ccf
Aug 16, 2018 8:53:11 AM org.apache.commons.jcs.utils.threadpool.ThreadPoolManager loadConfig
INFO: thread_pool.default PoolConfiguration = useBoundary = [false] boundarySize = [2000] maximumPoolSize = [150] minimumPoolSize = [4] keepAliveTime = [300000] whenBlockedPolicy = [RUN] startUpSize = [4]
Aug 16, 2018 8:53:11 AM org.apache.commons.jcs.engine.control.CompositeCacheManager doConfigure
INFO: Setting default auxiliaries to
Aug 16, 2018 8:53:11 AM org.apache.commons.jcs.engine.control.CompositeCacheManager doConfigure
INFO: setting defaultCompositeCacheAttributes to [ useLateral = true, useRemote = true, useDisk = true, maxObjs = 1000, maxSpoolPerRun = -1, diskUsagePattern = SWAP, spoolChunkSize = 2 ]
Aug 16, 2018 8:53:11 AM org.apache.commons.jcs.engine.control.CompositeCacheConfigurator parseElementAttributes
INFO: No special ElementAttribute class defined for key [jcs.default.elementattributes], using default class.
Aug 16, 2018 8:53:11 AM org.apache.commons.jcs.engine.control.CompositeCacheManager doConfigure
INFO: setting defaultElementAttributes to [ IS_LATERAL = true, IS_SPOOL = true, IS_REMOTE = true, IS_ETERNAL = true, MaxLifeSeconds = -1, IdleTime = -1, CreateTime = 1534409591357, LastAccessTime = 1534409591357, getTimeToLiveSeconds() = -1, createTime = 1534409591357 ]
Aug 16, 2018 8:53:11 AM org.apache.commons.jcs.engine.control.CompositeCacheConfigurator parseElementAttributes
INFO: No special ElementAttribute class defined for key [jcs.region.testCache1.elementattributes], using default class.
Aug 16, 2018 8:53:11 AM org.apache.commons.jcs.engine.memory.AbstractDoubleLinkedListMemoryCache initialize
INFO: initialized MemoryCache for testCache1
Aug 16, 2018 8:53:11 AM org.apache.commons.jcs.engine.control.CompositeCache <init>
INFO: Constructed cache with name [testCache1] and cache attributes [ useLateral = true, useRemote = true, useDisk = true, maxObjs = 1000, maxSpoolPerRun = -1, diskUsagePattern = SWAP, spoolChunkSize = 2 ]
Aug 16, 2018 8:53:11 AM org.apache.commons.jcs.engine.control.CompositeCacheConfigurator parseRegions
INFO: Parsed regions [testCache1]
Aug 16, 2018 8:53:11 AM org.apache.commons.jcs.engine.control.CompositeCacheManager doConfigure
INFO: Finished configuration in 35 ms.
Tests run: 3, Failures: 0, Errors: 0, Skipped: 0, Time elapsed: 0.325 sec - in org.apache.torque.manager.MethodResultCacheTest
Aug 16, 2018 8:53:11 AM org.apache.commons.jcs.engine.control.CompositeCacheManager run
INFO: Shutdown hook activated.  Shutdown was not called.  Shutting down JCS.
Running org.apache.torque.om.mapper.StringMapperTest
Tests run: 3, Failures: 0, Errors: 0, Skipped: 0, Time elapsed: 0.408 sec - in org.apache.torque.om.mapper.StringMapperTest
Running org.apache.torque.om.mapper.BigDecimalMapperTest
Tests run: 3, Failures: 0, Errors: 0, Skipped: 0, Time elapsed: 0.4 sec - in org.apache.torque.om.mapper.BigDecimalMapperTest
Running org.apache.torque.om.mapper.IntegerMapperTest
Tests run: 3, Failures: 0, Errors: 0, Skipped: 0, Time elapsed: 0.405 sec - in org.apache.torque.om.mapper.IntegerMapperTest
Running org.apache.torque.om.mapper.CompositeMapperTest
Tests run: 2, Failures: 0, Errors: 0, Skipped: 0, Time elapsed: 0.409 sec - in org.apache.torque.om.mapper.CompositeMapperTest
Running org.apache.torque.om.mapper.LongMapperTest
Tests run: 3, Failures: 0, Errors: 0, Skipped: 0, Time elapsed: 0.42 sec - in org.apache.torque.om.mapper.LongMapperTest
Running org.apache.torque.om.mapper.DateMapperTest
Tests run: 3, Failures: 0, Errors: 0, Skipped: 0, Time elapsed: 0.377 sec - in org.apache.torque.om.mapper.DateMapperTest
Running org.apache.torque.om.mapper.ObjectListMapperTest
Tests run: 12, Failures: 0, Errors: 0, Skipped: 0, Time elapsed: 0.523 sec - in org.apache.torque.om.mapper.ObjectListMapperTest
Running org.apache.torque.om.ComboKeyTest
Tests run: 9, Failures: 0, Errors: 0, Skipped: 0, Time elapsed: 0.043 sec - in org.apache.torque.om.ComboKeyTest
Running org.apache.torque.om.NumberKeyTest
Tests run: 23, Failures: 0, Errors: 0, Skipped: 0, Time elapsed: 0.045 sec - in org.apache.torque.om.NumberKeyTest
Running org.apache.torque.criteria.CriterionTest
Tests run: 10, Failures: 0, Errors: 0, Skipped: 0, Time elapsed: 0.208 sec - in org.apache.torque.criteria.CriterionTest
Running org.apache.torque.criteria.CriteriaTest
Tests run: 33, Failures: 0, Errors: 0, Skipped: 0, Time elapsed: 0.38 sec - in org.apache.torque.criteria.CriteriaTest
Running org.apache.torque.criteria.JoinTest
Tests run: 2, Failures: 0, Errors: 0, Skipped: 0, Time elapsed: 0.168 sec - in org.apache.torque.criteria.JoinTest
Running org.apache.torque.adapter.DBOracleTest
Tests run: 1, Failures: 0, Errors: 0, Skipped: 0, Time elapsed: 0.059 sec - in org.apache.torque.adapter.DBOracleTest
Running org.apache.torque.TorqueInstanceTest
Tests run: 5, Failures: 0, Errors: 0, Skipped: 0, Time elapsed: 0.165 sec - in org.apache.torque.TorqueInstanceTest

Results :

Tests run: 365, Failures: 0, Errors: 0, Skipped: 0

[JENKINS] Recording test results
[WARNING] Attempt to (de-)serialize anonymous class hudson.maven.reporters.SurefireArchiver$2; see: https://jenkins.io/redirect/serialization-of-anonymous-classes/
[WARNING] Attempt to (de-)serialize anonymous class hudson.maven.reporters.BuildInfoRecorder$1; see: https://jenkins.io/redirect/serialization-of-anonymous-classes/
[INFO]
[INFO] --- maven-jar-plugin:3.0.0:jar (default-jar) @ torque-runtime ---
[INFO] Building jar: <https://builds.apache.org/job/Torque4-trunk/ws/torque4-trunk/torque-runtime/target/torque-runtime-4.1-SNAPSHOT.jar>
[INFO]
[INFO] --- maven-site-plugin:3.5.1:attach-descriptor (attach-descriptor) @ torque-runtime ---
[INFO]
[INFO] --- maven-source-plugin:3.0.0:jar-no-fork (attach-sources) @ torque-runtime ---
[INFO] Building jar: <https://builds.apache.org/job/Torque4-trunk/ws/torque4-trunk/torque-runtime/target/torque-runtime-4.1-SNAPSHOT-sources.jar>
[INFO]
[INFO] --- apache-rat-plugin:0.11:check (default) @ torque-runtime ---
[INFO] 51 implicit excludes (use -debug for more details).
[INFO] Exclude: velocity.log
[INFO] Exclude: .checkstyle
[INFO] Exclude: checkstyle-cache.ccf
[INFO] Exclude: derby.log
[INFO] Exclude: LICENSE-EDL.txt
[INFO] Exclude: DEPENDENCIES
[INFO] Exclude: torque-test/target/**/*
[INFO] Exclude: torque-test/.classpath
[INFO] Exclude: torque-test/.project
[INFO] Exclude: torque-test/.settings/**
[INFO] Exclude: torque-test/src/main/generated-java/**/*
[INFO] Exclude: torque-test/derby.log
[INFO] 182 resources included (use -debug for more details)
[INFO] Rat check: Summary of files. Unapproved: 0 unknown: 0 generated: 0 approved: 180 licence.
[CHECKSTYLE] No report found for mojo check
[PMD] No report found for mojo check
[INFO]
[INFO] --- dependency-check-maven:3.1.2:check (default) @ torque-runtime ---
[INFO] Skipping dependency-check
[CHECKSTYLE] No report found for mojo check
[PMD] No report found for mojo check
[INFO]
[INFO] --- maven-install-plugin:2.5.2:install (default-install) @ torque-runtime ---
[INFO] Installing <https://builds.apache.org/job/Torque4-trunk/ws/torque4-trunk/torque-runtime/target/torque-runtime-4.1-SNAPSHOT.jar> to /home/jenkins/jenkins-slave/maven-repositories/0/org/apache/torque/torque-runtime/4.1-SNAPSHOT/torque-runtime-4.1-SNAPSHOT.jar
[INFO] Installing <https://builds.apache.org/job/Torque4-trunk/ws/torque4-trunk/torque-runtime/pom.xml> to /home/jenkins/jenkins-slave/maven-repositories/0/org/apache/torque/torque-runtime/4.1-SNAPSHOT/torque-runtime-4.1-SNAPSHOT.pom
[INFO] Installing <https://builds.apache.org/job/Torque4-trunk/ws/torque4-trunk/torque-runtime/target/torque-runtime-4.1-SNAPSHOT-sources.jar> to /home/jenkins/jenkins-slave/maven-repositories/0/org/apache/torque/torque-runtime/4.1-SNAPSHOT/torque-runtime-4.1-SNAPSHOT-sources.jar
[INFO]
[INFO] >>> cobertura-maven-plugin:2.3:cobertura (default-cli) > [cobertura]test @ torque-runtime >>>
[INFO]
[INFO] --- maven-remote-resources-plugin:1.5:process (process-resource-bundles) @ torque-runtime ---
[INFO]
[INFO] --- maven-resources-plugin:2.7:resources (default-resources) @ torque-runtime ---
[INFO] Using 'ISO-8859-1' encoding to copy filtered resources.
[INFO] skip non existing resourceDirectory <https://builds.apache.org/job/Torque4-trunk/ws/torque4-trunk/torque-runtime/src/main/resources>
[INFO] Copying 3 resources
[INFO] Copying 3 resources
[INFO]
[INFO] --- maven-compiler-plugin:3.5.1:compile (default-compile) @ torque-runtime ---
[INFO] Nothing to compile - all classes are up to date
[INFO]
[INFO] --- cobertura-maven-plugin:2.3:instrument (default-cli) @ torque-runtime ---
[INFO] Cobertura 1.9.2 - GNU GPL License (NO WARRANTY) - See COPYRIGHT file
Instrumenting 122 files to <https://builds.apache.org/job/Torque4-trunk/ws/torque4-trunk/torque-runtime/target/generated-classes/cobertura>
Cobertura: Saved information on 122 classes.
Instrument time: 475ms

[INFO] Instrumentation was successful.
[INFO]
[INFO] --- maven-resources-plugin:2.7:testResources (default-testResources) @ torque-runtime ---
[INFO] Using 'ISO-8859-1' encoding to copy filtered resources.
[INFO] Copying 5 resources
[INFO] Copying 3 resources
[INFO] Copying 3 resources
[INFO]
[INFO] --- maven-compiler-plugin:3.5.1:testCompile (default-testCompile) @ torque-runtime ---
[INFO] Nothing to compile - all classes are up to date
[INFO]
[INFO] --- maven-surefire-plugin:2.19.1:test (default-test) @ torque-runtime ---

-------------------------------------------------------
 T E S T S
-------------------------------------------------------

Results :

Tests run: 0, Failures: 0, Errors: 0, Skipped: 0

[JENKINS] Recording test results
[INFO] ------------------------------------------------------------------------
[INFO] Reactor Summary:
[INFO]
[INFO] Torque Maven Parent 4.1-SNAPSHOT ................... SUCCESS [01:18 min]
[INFO] Torque Runtime ..................................... FAILURE [ 52.294 s]
[INFO] Torque Generator ................................... SKIPPED
[INFO] Torque Templates ................................... SKIPPED
[INFO] Torque Generator Maven 2 Plugin .................... SKIPPED
[INFO] Torque Generator Ant tasks ......................... SKIPPED
[INFO] Torque Site 4.1-SNAPSHOT ........................... SKIPPED
[INFO] ------------------------------------------------------------------------
[INFO] BUILD FAILURE
[INFO] ------------------------------------------------------------------------
[INFO] Total time: 02:28 min
[INFO] Finished at: 2018-08-16T08:53:51Z
[INFO] ------------------------------------------------------------------------
Waiting for Jenkins to finish collecting data
[ERROR] Failed to execute goal org.apache.maven.plugins:maven-surefire-plugin:2.19.1:test (default-test) on project torque-runtime: Execution default-test of goal org.apache.maven.plugins:maven-surefire-plugin:2.19.1:test failed: There was an error in the forked process
[ERROR] java.lang.VerifyError:
[ERROR] Expecting a stackmap frame at branch target 107
[ERROR] Exception Details:
[ERROR] Location:
[ERROR] org/apache/torque/manager/AbstractBaseManager.dispose()V @32: ifnull
[ERROR] Reason:
[ERROR] Expected stackmap frame at this location.
[ERROR] Bytecode:
[ERROR] 0x0000000: 033c 11ff ff3d b800 2e12 30b6 0034 1101
[ERROR] 0x0000010: 17b6 003a 2ab4 00c0 1101 173c 1100 003d
[ERROR] 0x0000020: c600 4b1b 1101 17a0 001c 1c11 0000 a000
[ERROR] 0x0000030: 15b8 002e 1230 b600 341b 1c04 b600 9c11
[ERROR] 0x0000040: ffff 3db8 002e 1230 b600 3411 0119 b600
[ERROR] 0x0000050: 3a2a b400 c0b6 00d3 b800 2e12 30b6 0034
[ERROR] 0x0000060: 1101 1ab6 003a 2a01 b500 c01c 9b00 15b8
[ERROR] 0x0000070: 002e 1230 b600 341b 1c03 b600 9c11 ffff
[ERROR] 0x0000080: 3db8 002e 1230 b600 3411 011d b600 3a2a
[ERROR] 0x0000090: b400 d511 011d 3c11 0000 3dc6 004b 1b11
[ERROR] 0x00000a0: 011d a000 1c1c 1100 00a0 0015 b800 2e12
[ERROR] 0x00000b0: 30b6 0034 1b1c 04b6 009c 11ff ff3d b800
[ERROR] 0x00000c0: 2e12 30b6 0034 1101 1fb6 003a 2ab4 00d5
[ERROR] 0x00000d0: b600 d8b8 002e 1230 b600 3411 0120 b600
[ERROR] 0x00000e0: 3a2a 01b5 00d5 1c9b 0015 b800 2e12 30b6
[ERROR] 0x00000f0: 0034 1b1c 03b6 009c 11ff ff3d b800 2e12
[ERROR] 0x0000100: 30b6 0034 1101 23b6 003a 2ab4 0043 b600
[ERROR] 0x0000110: d9b8 002e 1230 b600 3411 0124 b600 3a2a
[ERROR] 0x0000120: b400 48b9 00dc 0100 b800 2e12 30b6 0034
[ERROR] 0x0000130: 1101 25b6 003a b1
[ERROR] Stackmap Table:
[ERROR] same_frame_extended(@143)
[ERROR] same_frame_extended(@266)
[ERROR]
[ERROR] at java.lang.Class.getDeclaredMethods0(Native Method)
[ERROR] at java.lang.Class.privateGetDeclaredMethods(Class.java:2701)
[ERROR] at java.lang.Class.privateGetMethodRecursive(Class.java:3048)
[ERROR] at java.lang.Class.getMethod0(Class.java:3018)
[ERROR] at java.lang.Class.getMethod(Class.java:1784)
[ERROR] at org.apache.maven.surefire.util.ReflectionUtils.tryGetMethod(ReflectionUtils.java:61)
[ERROR] at org.apache.maven.surefire.common.junit3.JUnit3TestChecker.isSuiteOnly(JUnit3TestChecker.java:64)
[ERROR] at org.apache.maven.surefire.common.junit3.JUnit3TestChecker.isValidJUnit3Test(JUnit3TestChecker.java:59)
[ERROR] at org.apache.maven.surefire.common.junit3.JUnit3TestChecker.accept(JUnit3TestChecker.java:54)
[ERROR] at org.apache.maven.surefire.common.junit4.JUnit4TestChecker.accept(JUnit4TestChecker.java:52)
[ERROR] at org.apache.maven.surefire.util.DefaultScanResult.applyFilter(DefaultScanResult.java:98)
[ERROR] at org.apache.maven.surefire.junit4.JUnit4Provider.scanClassPath(JUnit4Provider.java:311)
[ERROR] at org.apache.maven.surefire.junit4.JUnit4Provider.setTestsToRun(JUnit4Provider.java:191)
[ERROR] at org.apache.maven.surefire.junit4.JUnit4Provider.invoke(JUnit4Provider.java:134)
[ERROR] at org.apache.maven.surefire.booter.ForkedBooter.invokeProviderInSameClassLoader(ForkedBooter.java:290)
[ERROR] at org.apache.maven.surefire.booter.ForkedBooter.runSuitesInProcess(ForkedBooter.java:242)
[ERROR] at org.apache.maven.surefire.booter.ForkedBooter.main(ForkedBooter.java:121)
[ERROR] -> [Help 1]
[ERROR]
[ERROR] To see the full stack trace of the errors, re-run Maven with the -e switch.
[ERROR] Re-run Maven using the -X switch to enable full debug logging.
[ERROR]
[ERROR] For more information about the errors and possible solutions, please read the following articles:
[ERROR] [Help 1] http://cwiki.apache.org/confluence/display/MAVEN/PluginExecutionException
[ERROR]
[ERROR] After correcting the problems, you can resume the build with the command
[ERROR]   mvn <goals> -rf :torque-runtime
[JENKINS] Archiving <https://builds.apache.org/job/Torque4-trunk/ws/torque4-trunk/torque-maven-plugin/pom.xml> to org.apache.torque/torque-maven-plugin/4.1-SNAPSHOT/torque-maven-plugin-4.1-SNAPSHOT.pom
[JENKINS] Archiving <https://builds.apache.org/job/Torque4-trunk/ws/torque4-trunk/pom.xml> to org.apache.torque/torque/4.1-SNAPSHOT/torque-4.1-SNAPSHOT.pom
<https://builds.apache.org/job/Torque4-trunk/ws/torque4-trunk/pom.xml> is not inside <https://builds.apache.org/job/Torque4-trunk/ws/torque4-trunk/torque4-trunk/;> will archive in a separate pass
[JENKINS] Archiving <https://builds.apache.org/job/Torque4-trunk/ws/torque4-trunk/torque-site/pom.xml> to org.apache.torque/torque-site/4.1-SNAPSHOT/torque-site-4.1-SNAPSHOT.pom
[JENKINS] Archiving <https://builds.apache.org/job/Torque4-trunk/ws/torque4-trunk/torque-generator/pom.xml> to org.apache.torque/torque-generator/4.1-SNAPSHOT/torque-generator-4.1-SNAPSHOT.pom
[JENKINS] Archiving <https://builds.apache.org/job/Torque4-trunk/ws/torque4-trunk/torque-templates/pom.xml> to org.apache.torque/torque-templates/4.1-SNAPSHOT/torque-templates-4.1-SNAPSHOT.pom
[JENKINS] Archiving <https://builds.apache.org/job/Torque4-trunk/ws/torque4-trunk/torque-runtime/pom.xml> to org.apache.torque/torque-runtime/4.1-SNAPSHOT/torque-runtime-4.1-SNAPSHOT.pom
[JENKINS] Archiving <https://builds.apache.org/job/Torque4-trunk/ws/torque4-trunk/torque-runtime/target/torque-runtime-4.1-SNAPSHOT.jar> to org.apache.torque/torque-runtime/4.1-SNAPSHOT/torque-runtime-4.1-SNAPSHOT.jar
[JENKINS] Archiving <https://builds.apache.org/job/Torque4-trunk/ws/torque4-trunk/torque-runtime/target/torque-runtime-4.1-SNAPSHOT-sources.jar> to org.apache.torque/torque-runtime/4.1-SNAPSHOT/torque-runtime-4.1-SNAPSHOT-sources.jar
[JENKINS] Archiving <https://builds.apache.org/job/Torque4-trunk/ws/torque4-trunk/torque-ant-tasks/pom.xml> to org.apache.torque/torque-ant-tasks/4.1-SNAPSHOT/torque-ant-tasks-4.1-SNAPSHOT.pom
Sending e-mails to: [hidden email]
channel stopped
[Cobertura] Publishing Cobertura coverage report...


---------------------------------------------------------------------
To unsubscribe, e-mail: [hidden email]
For additional commands, e-mail: [hidden email]

Reply | Threaded
Open this post in threaded view
|

Build failed in Jenkins: Torque4-trunk #581

Apache Jenkins Server-2
See <https://builds.apache.org/job/Torque4-trunk/581/display/redirect?page=changes>

Changes:

[tv] Use try-with-resources where applicable
Replace StringBuffer with StringBuilder

------------------------------------------
[...truncated 211.60 KB...]
Tests run: 4, Failures: 0, Errors: 0, Skipped: 0, Time elapsed: 0.035 sec - in org.apache.torque.util.functions.SumTest
Running org.apache.torque.util.functions.AggregateFunctionTest
Tests run: 12, Failures: 0, Errors: 0, Skipped: 0, Time elapsed: 0.035 sec - in org.apache.torque.util.functions.AggregateFunctionTest
Running org.apache.torque.util.functions.AbstractFunctionTest
Tests run: 11, Failures: 0, Errors: 0, Skipped: 0, Time elapsed: 0.042 sec - in org.apache.torque.util.functions.AbstractFunctionTest
Running org.apache.torque.criteria.CriteriaTest
Tests run: 33, Failures: 0, Errors: 0, Skipped: 0, Time elapsed: 0.356 sec - in org.apache.torque.criteria.CriteriaTest
Running org.apache.torque.criteria.JoinTest
Tests run: 2, Failures: 0, Errors: 0, Skipped: 0, Time elapsed: 0.149 sec - in org.apache.torque.criteria.JoinTest
Running org.apache.torque.criteria.CriterionTest
Tests run: 10, Failures: 0, Errors: 0, Skipped: 0, Time elapsed: 0.153 sec - in org.apache.torque.criteria.CriterionTest
Running org.apache.torque.ColumnImplTest
Tests run: 41, Failures: 0, Errors: 0, Skipped: 0, Time elapsed: 0.225 sec - in org.apache.torque.ColumnImplTest
Running org.apache.torque.adapter.DBOracleTest
Tests run: 1, Failures: 0, Errors: 0, Skipped: 0, Time elapsed: 0.045 sec - in org.apache.torque.adapter.DBOracleTest
Running org.apache.torque.manager.MethodResultCacheTest
Aug 16, 2018 9:33:38 AM org.apache.commons.jcs.engine.control.CompositeCacheManager getInstance
INFO: Instance is null, creating with config [/cache.ccf]
Aug 16, 2018 9:33:38 AM org.apache.commons.jcs.engine.control.CompositeCacheManager configure
INFO: Creating cache manager from config file: /cache.ccf
Aug 16, 2018 9:33:38 AM org.apache.commons.jcs.utils.threadpool.ThreadPoolManager loadConfig
INFO: thread_pool.default PoolConfiguration = useBoundary = [false] boundarySize = [2000] maximumPoolSize = [150] minimumPoolSize = [4] keepAliveTime = [300000] whenBlockedPolicy = [RUN] startUpSize = [4]
Aug 16, 2018 9:33:38 AM org.apache.commons.jcs.engine.control.CompositeCacheManager doConfigure
INFO: Setting default auxiliaries to
Aug 16, 2018 9:33:38 AM org.apache.commons.jcs.engine.control.CompositeCacheManager doConfigure
INFO: setting defaultCompositeCacheAttributes to [ useLateral = true, useRemote = true, useDisk = true, maxObjs = 1000, maxSpoolPerRun = -1, diskUsagePattern = SWAP, spoolChunkSize = 2 ]
Aug 16, 2018 9:33:38 AM org.apache.commons.jcs.engine.control.CompositeCacheConfigurator parseElementAttributes
INFO: No special ElementAttribute class defined for key [jcs.default.elementattributes], using default class.
Aug 16, 2018 9:33:38 AM org.apache.commons.jcs.engine.control.CompositeCacheManager doConfigure
INFO: setting defaultElementAttributes to [ IS_LATERAL = true, IS_SPOOL = true, IS_REMOTE = true, IS_ETERNAL = true, MaxLifeSeconds = -1, IdleTime = -1, CreateTime = 1534412018259, LastAccessTime = 1534412018259, getTimeToLiveSeconds() = -1, createTime = 1534412018259 ]
Aug 16, 2018 9:33:38 AM org.apache.commons.jcs.engine.control.CompositeCacheConfigurator parseElementAttributes
INFO: No special ElementAttribute class defined for key [jcs.region.testCache1.elementattributes], using default class.
Aug 16, 2018 9:33:38 AM org.apache.commons.jcs.engine.memory.AbstractDoubleLinkedListMemoryCache initialize
INFO: initialized MemoryCache for testCache1
Aug 16, 2018 9:33:38 AM org.apache.commons.jcs.engine.control.CompositeCache <init>
INFO: Constructed cache with name [testCache1] and cache attributes [ useLateral = true, useRemote = true, useDisk = true, maxObjs = 1000, maxSpoolPerRun = -1, diskUsagePattern = SWAP, spoolChunkSize = 2 ]
Aug 16, 2018 9:33:38 AM org.apache.commons.jcs.engine.control.CompositeCacheConfigurator parseRegions
INFO: Parsed regions [testCache1]
Aug 16, 2018 9:33:38 AM org.apache.commons.jcs.engine.control.CompositeCacheManager doConfigure
INFO: Finished configuration in 40 ms.
Tests run: 3, Failures: 0, Errors: 0, Skipped: 0, Time elapsed: 0.323 sec - in org.apache.torque.manager.MethodResultCacheTest
Aug 16, 2018 9:33:38 AM org.apache.commons.jcs.engine.control.CompositeCacheManager run
INFO: Shutdown hook activated.  Shutdown was not called.  Shutting down JCS.
Running org.apache.torque.manager.AbstractBaseManagerTest
Aug 16, 2018 9:33:38 AM org.apache.commons.jcs.engine.control.CompositeCacheManager getInstance
INFO: Instance is null, creating with config [/cache.ccf]
Aug 16, 2018 9:33:39 AM org.apache.commons.jcs.engine.control.CompositeCacheManager configure
INFO: Creating cache manager from config file: /cache.ccf
Aug 16, 2018 9:33:39 AM org.apache.commons.jcs.utils.threadpool.ThreadPoolManager loadConfig
INFO: thread_pool.default PoolConfiguration = useBoundary = [false] boundarySize = [2000] maximumPoolSize = [150] minimumPoolSize = [4] keepAliveTime = [300000] whenBlockedPolicy = [RUN] startUpSize = [4]
Aug 16, 2018 9:33:39 AM org.apache.commons.jcs.engine.control.CompositeCacheManager doConfigure
INFO: Setting default auxiliaries to
Aug 16, 2018 9:33:39 AM org.apache.commons.jcs.engine.control.CompositeCacheManager doConfigure
INFO: setting defaultCompositeCacheAttributes to [ useLateral = true, useRemote = true, useDisk = true, maxObjs = 1000, maxSpoolPerRun = -1, diskUsagePattern = SWAP, spoolChunkSize = 2 ]
Aug 16, 2018 9:33:39 AM org.apache.commons.jcs.engine.control.CompositeCacheConfigurator parseElementAttributes
INFO: No special ElementAttribute class defined for key [jcs.default.elementattributes], using default class.
Aug 16, 2018 9:33:39 AM org.apache.commons.jcs.engine.control.CompositeCacheManager doConfigure
INFO: setting defaultElementAttributes to [ IS_LATERAL = true, IS_SPOOL = true, IS_REMOTE = true, IS_ETERNAL = true, MaxLifeSeconds = -1, IdleTime = -1, CreateTime = 1534412019122, LastAccessTime = 1534412019122, getTimeToLiveSeconds() = -1, createTime = 1534412019122 ]
Aug 16, 2018 9:33:39 AM org.apache.commons.jcs.engine.control.CompositeCacheConfigurator parseElementAttributes
INFO: No special ElementAttribute class defined for key [jcs.region.testCache1.elementattributes], using default class.
Aug 16, 2018 9:33:39 AM org.apache.commons.jcs.engine.memory.AbstractDoubleLinkedListMemoryCache initialize
INFO: initialized MemoryCache for testCache1
Aug 16, 2018 9:33:39 AM org.apache.commons.jcs.engine.control.CompositeCache <init>
INFO: Constructed cache with name [testCache1] and cache attributes [ useLateral = true, useRemote = true, useDisk = true, maxObjs = 1000, maxSpoolPerRun = -1, diskUsagePattern = SWAP, spoolChunkSize = 2 ]
Aug 16, 2018 9:33:39 AM org.apache.commons.jcs.engine.control.CompositeCacheConfigurator parseRegions
INFO: Parsed regions [testCache1]
Aug 16, 2018 9:33:39 AM org.apache.commons.jcs.engine.control.CompositeCacheManager doConfigure
INFO: Finished configuration in 40 ms.
Tests run: 9, Failures: 0, Errors: 0, Skipped: 0, Time elapsed: 0.326 sec - in org.apache.torque.manager.AbstractBaseManagerTest
Aug 16, 2018 9:33:39 AM org.apache.commons.jcs.engine.control.CompositeCacheManager run
INFO: Shutdown hook activated.  Shutdown was not called.  Shutting down JCS.

Results :

Tests run: 365, Failures: 0, Errors: 0, Skipped: 0

[JENKINS] Recording test results
[WARNING] Attempt to (de-)serialize anonymous class hudson.maven.reporters.SurefireArchiver$2; see: https://jenkins.io/redirect/serialization-of-anonymous-classes/
[WARNING] Attempt to (de-)serialize anonymous class hudson.maven.reporters.BuildInfoRecorder$1; see: https://jenkins.io/redirect/serialization-of-anonymous-classes/
[INFO]
[INFO] --- maven-jar-plugin:3.0.0:jar (default-jar) @ torque-runtime ---
[INFO] Building jar: <https://builds.apache.org/job/Torque4-trunk/ws/torque4-trunk/torque-runtime/target/torque-runtime-4.1-SNAPSHOT.jar>
[INFO]
[INFO] --- maven-site-plugin:3.5.1:attach-descriptor (attach-descriptor) @ torque-runtime ---
[INFO]
[INFO] --- maven-source-plugin:3.0.0:jar-no-fork (attach-sources) @ torque-runtime ---
[INFO] Building jar: <https://builds.apache.org/job/Torque4-trunk/ws/torque4-trunk/torque-runtime/target/torque-runtime-4.1-SNAPSHOT-sources.jar>
[INFO]
[INFO] --- apache-rat-plugin:0.11:check (default) @ torque-runtime ---
[INFO] 51 implicit excludes (use -debug for more details).
[INFO] Exclude: velocity.log
[INFO] Exclude: .checkstyle
[INFO] Exclude: checkstyle-cache.ccf
[INFO] Exclude: derby.log
[INFO] Exclude: LICENSE-EDL.txt
[INFO] Exclude: DEPENDENCIES
[INFO] Exclude: torque-test/target/**/*
[INFO] Exclude: torque-test/.classpath
[INFO] Exclude: torque-test/.project
[INFO] Exclude: torque-test/.settings/**
[INFO] Exclude: torque-test/src/main/generated-java/**/*
[INFO] Exclude: torque-test/derby.log
[INFO] 182 resources included (use -debug for more details)
[INFO] Rat check: Summary of files. Unapproved: 0 unknown: 0 generated: 0 approved: 180 licence.
[CHECKSTYLE] No report found for mojo check
[PMD] No report found for mojo check
[INFO]
[INFO] --- dependency-check-maven:3.1.2:check (default) @ torque-runtime ---
[INFO] Skipping dependency-check
[CHECKSTYLE] No report found for mojo check
[PMD] No report found for mojo check
[INFO]
[INFO] --- maven-install-plugin:2.5.2:install (default-install) @ torque-runtime ---
[INFO] Installing <https://builds.apache.org/job/Torque4-trunk/ws/torque4-trunk/torque-runtime/target/torque-runtime-4.1-SNAPSHOT.jar> to /home/jenkins/jenkins-slave/maven-repositories/1/org/apache/torque/torque-runtime/4.1-SNAPSHOT/torque-runtime-4.1-SNAPSHOT.jar
[INFO] Installing <https://builds.apache.org/job/Torque4-trunk/ws/torque4-trunk/torque-runtime/pom.xml> to /home/jenkins/jenkins-slave/maven-repositories/1/org/apache/torque/torque-runtime/4.1-SNAPSHOT/torque-runtime-4.1-SNAPSHOT.pom
[INFO] Installing <https://builds.apache.org/job/Torque4-trunk/ws/torque4-trunk/torque-runtime/target/torque-runtime-4.1-SNAPSHOT-sources.jar> to /home/jenkins/jenkins-slave/maven-repositories/1/org/apache/torque/torque-runtime/4.1-SNAPSHOT/torque-runtime-4.1-SNAPSHOT-sources.jar
[INFO]
[INFO] >>> cobertura-maven-plugin:2.3:cobertura (default-cli) > [cobertura]test @ torque-runtime >>>
[INFO]
[INFO] --- maven-remote-resources-plugin:1.5:process (process-resource-bundles) @ torque-runtime ---
[INFO]
[INFO] --- maven-resources-plugin:2.7:resources (default-resources) @ torque-runtime ---
[INFO] Using 'ISO-8859-1' encoding to copy filtered resources.
[INFO] skip non existing resourceDirectory <https://builds.apache.org/job/Torque4-trunk/ws/torque4-trunk/torque-runtime/src/main/resources>
[INFO] Copying 3 resources
[INFO] Copying 3 resources
[INFO]
[INFO] --- maven-compiler-plugin:3.5.1:compile (default-compile) @ torque-runtime ---
[INFO] Nothing to compile - all classes are up to date
[INFO]
[INFO] --- cobertura-maven-plugin:2.3:instrument (default-cli) @ torque-runtime ---
[INFO] Cobertura 1.9.2 - GNU GPL License (NO WARRANTY) - See COPYRIGHT file
Instrumenting 122 files to <https://builds.apache.org/job/Torque4-trunk/ws/torque4-trunk/torque-runtime/target/generated-classes/cobertura>
Cobertura: Saved information on 122 classes.
Instrument time: 471ms

[INFO] Instrumentation was successful.
[INFO]
[INFO] --- maven-resources-plugin:2.7:testResources (default-testResources) @ torque-runtime ---
[INFO] Using 'ISO-8859-1' encoding to copy filtered resources.
[INFO] Copying 5 resources
[INFO] Copying 3 resources
[INFO] Copying 3 resources
[INFO]
[INFO] --- maven-compiler-plugin:3.5.1:testCompile (default-testCompile) @ torque-runtime ---
[INFO] Nothing to compile - all classes are up to date
[INFO]
[INFO] --- maven-surefire-plugin:2.19.1:test (default-test) @ torque-runtime ---

-------------------------------------------------------
 T E S T S
-------------------------------------------------------

Results :

Tests run: 0, Failures: 0, Errors: 0, Skipped: 0

[JENKINS] Recording test results
[INFO] ------------------------------------------------------------------------
[INFO] Reactor Summary:
[INFO]
[INFO] Torque Maven Parent 4.1-SNAPSHOT ................... SUCCESS [01:18 min]
[INFO] Torque Runtime ..................................... FAILURE [ 48.854 s]
[INFO] Torque Generator ................................... SKIPPED
[INFO] Torque Templates ................................... SKIPPED
[INFO] Torque Generator Maven 2 Plugin .................... SKIPPED
[INFO] Torque Generator Ant tasks ......................... SKIPPED
[INFO] Torque Site 4.1-SNAPSHOT ........................... SKIPPED
[INFO] ------------------------------------------------------------------------
[INFO] BUILD FAILURE
[INFO] ------------------------------------------------------------------------
[INFO] Total time: 02:25 min
[INFO] Finished at: 2018-08-16T09:34:05Z
[INFO] ------------------------------------------------------------------------
Waiting for Jenkins to finish collecting data
[ERROR] Failed to execute goal org.apache.maven.plugins:maven-surefire-plugin:2.19.1:test (default-test) on project torque-runtime: Execution default-test of goal org.apache.maven.plugins:maven-surefire-plugin:2.19.1:test failed: There was an error in the forked process
[ERROR] java.lang.VerifyError:
[ERROR] Expecting a stackmap frame at branch target 107
[ERROR] Exception Details:
[ERROR] Location:
[ERROR] org/apache/torque/manager/AbstractBaseManager.dispose()V @32: ifnull
[ERROR] Reason:
[ERROR] Expected stackmap frame at this location.
[ERROR] Bytecode:
[ERROR] 0x0000000: 033c 11ff ff3d b800 2e12 30b6 0034 1101
[ERROR] 0x0000010: 17b6 003a 2ab4 00c0 1101 173c 1100 003d
[ERROR] 0x0000020: c600 4b1b 1101 17a0 001c 1c11 0000 a000
[ERROR] 0x0000030: 15b8 002e 1230 b600 341b 1c04 b600 9c11
[ERROR] 0x0000040: ffff 3db8 002e 1230 b600 3411 0119 b600
[ERROR] 0x0000050: 3a2a b400 c0b6 00d3 b800 2e12 30b6 0034
[ERROR] 0x0000060: 1101 1ab6 003a 2a01 b500 c01c 9b00 15b8
[ERROR] 0x0000070: 002e 1230 b600 341b 1c03 b600 9c11 ffff
[ERROR] 0x0000080: 3db8 002e 1230 b600 3411 011d b600 3a2a
[ERROR] 0x0000090: b400 d511 011d 3c11 0000 3dc6 004b 1b11
[ERROR] 0x00000a0: 011d a000 1c1c 1100 00a0 0015 b800 2e12
[ERROR] 0x00000b0: 30b6 0034 1b1c 04b6 009c 11ff ff3d b800
[ERROR] 0x00000c0: 2e12 30b6 0034 1101 1fb6 003a 2ab4 00d5
[ERROR] 0x00000d0: b600 d8b8 002e 1230 b600 3411 0120 b600
[ERROR] 0x00000e0: 3a2a 01b5 00d5 1c9b 0015 b800 2e12 30b6
[ERROR] 0x00000f0: 0034 1b1c 03b6 009c 11ff ff3d b800 2e12
[ERROR] 0x0000100: 30b6 0034 1101 23b6 003a 2ab4 0043 b600
[ERROR] 0x0000110: d9b8 002e 1230 b600 3411 0124 b600 3a2a
[ERROR] 0x0000120: b400 48b9 00dc 0100 b800 2e12 30b6 0034
[ERROR] 0x0000130: 1101 25b6 003a b1
[ERROR] Stackmap Table:
[ERROR] same_frame_extended(@143)
[ERROR] same_frame_extended(@266)
[ERROR]
[ERROR] at java.lang.Class.getDeclaredMethods0(Native Method)
[ERROR] at java.lang.Class.privateGetDeclaredMethods(Class.java:2701)
[ERROR] at java.lang.Class.privateGetMethodRecursive(Class.java:3048)
[ERROR] at java.lang.Class.getMethod0(Class.java:3018)
[ERROR] at java.lang.Class.getMethod(Class.java:1784)
[ERROR] at org.apache.maven.surefire.util.ReflectionUtils.tryGetMethod(ReflectionUtils.java:61)
[ERROR] at org.apache.maven.surefire.common.junit3.JUnit3TestChecker.isSuiteOnly(JUnit3TestChecker.java:64)
[ERROR] at org.apache.maven.surefire.common.junit3.JUnit3TestChecker.isValidJUnit3Test(JUnit3TestChecker.java:59)
[ERROR] at org.apache.maven.surefire.common.junit3.JUnit3TestChecker.accept(JUnit3TestChecker.java:54)
[ERROR] at org.apache.maven.surefire.common.junit4.JUnit4TestChecker.accept(JUnit4TestChecker.java:52)
[ERROR] at org.apache.maven.surefire.util.DefaultScanResult.applyFilter(DefaultScanResult.java:98)
[ERROR] at org.apache.maven.surefire.junit4.JUnit4Provider.scanClassPath(JUnit4Provider.java:311)
[ERROR] at org.apache.maven.surefire.junit4.JUnit4Provider.setTestsToRun(JUnit4Provider.java:191)
[ERROR] at org.apache.maven.surefire.junit4.JUnit4Provider.invoke(JUnit4Provider.java:134)
[ERROR] at org.apache.maven.surefire.booter.ForkedBooter.invokeProviderInSameClassLoader(ForkedBooter.java:290)
[ERROR] at org.apache.maven.surefire.booter.ForkedBooter.runSuitesInProcess(ForkedBooter.java:242)
[ERROR] at org.apache.maven.surefire.booter.ForkedBooter.main(ForkedBooter.java:121)
[ERROR] -> [Help 1]
[ERROR]
[ERROR] To see the full stack trace of the errors, re-run Maven with the -e switch.
[ERROR] Re-run Maven using the -X switch to enable full debug logging.
[ERROR]
[ERROR] For more information about the errors and possible solutions, please read the following articles:
[ERROR] [Help 1] http://cwiki.apache.org/confluence/display/MAVEN/PluginExecutionException
[ERROR]
[ERROR] After correcting the problems, you can resume the build with the command
[ERROR]   mvn <goals> -rf :torque-runtime
[JENKINS] Archiving <https://builds.apache.org/job/Torque4-trunk/ws/torque4-trunk/torque-maven-plugin/pom.xml> to org.apache.torque/torque-maven-plugin/4.1-SNAPSHOT/torque-maven-plugin-4.1-SNAPSHOT.pom
[JENKINS] Archiving <https://builds.apache.org/job/Torque4-trunk/ws/torque4-trunk/pom.xml> to org.apache.torque/torque/4.1-SNAPSHOT/torque-4.1-SNAPSHOT.pom
<https://builds.apache.org/job/Torque4-trunk/ws/torque4-trunk/pom.xml> is not inside <https://builds.apache.org/job/Torque4-trunk/ws/torque4-trunk/torque4-trunk/;> will archive in a separate pass
[JENKINS] Archiving <https://builds.apache.org/job/Torque4-trunk/ws/torque4-trunk/torque-site/pom.xml> to org.apache.torque/torque-site/4.1-SNAPSHOT/torque-site-4.1-SNAPSHOT.pom
[JENKINS] Archiving <https://builds.apache.org/job/Torque4-trunk/ws/torque4-trunk/torque-generator/pom.xml> to org.apache.torque/torque-generator/4.1-SNAPSHOT/torque-generator-4.1-SNAPSHOT.pom
[JENKINS] Archiving <https://builds.apache.org/job/Torque4-trunk/ws/torque4-trunk/torque-templates/pom.xml> to org.apache.torque/torque-templates/4.1-SNAPSHOT/torque-templates-4.1-SNAPSHOT.pom
[JENKINS] Archiving <https://builds.apache.org/job/Torque4-trunk/ws/torque4-trunk/torque-runtime/pom.xml> to org.apache.torque/torque-runtime/4.1-SNAPSHOT/torque-runtime-4.1-SNAPSHOT.pom
[JENKINS] Archiving <https://builds.apache.org/job/Torque4-trunk/ws/torque4-trunk/torque-runtime/target/torque-runtime-4.1-SNAPSHOT.jar> to org.apache.torque/torque-runtime/4.1-SNAPSHOT/torque-runtime-4.1-SNAPSHOT.jar
[JENKINS] Archiving <https://builds.apache.org/job/Torque4-trunk/ws/torque4-trunk/torque-runtime/target/torque-runtime-4.1-SNAPSHOT-sources.jar> to org.apache.torque/torque-runtime/4.1-SNAPSHOT/torque-runtime-4.1-SNAPSHOT-sources.jar
[JENKINS] Archiving <https://builds.apache.org/job/Torque4-trunk/ws/torque4-trunk/torque-ant-tasks/pom.xml> to org.apache.torque/torque-ant-tasks/4.1-SNAPSHOT/torque-ant-tasks-4.1-SNAPSHOT.pom
Sending e-mails to: [hidden email]
channel stopped
[Cobertura] Publishing Cobertura coverage report...


---------------------------------------------------------------------
To unsubscribe, e-mail: [hidden email]
For additional commands, e-mail: [hidden email]

Reply | Threaded
Open this post in threaded view
|

Build failed in Jenkins: Torque4-trunk #582

Apache Jenkins Server-2
See <https://builds.apache.org/job/Torque4-trunk/582/display/redirect?page=changes>

Changes:

[tv] Update dependency commons-dbcp2 to 2.5.0

[tv] Use try-with-resources where applicable

[tv] Cleanup

------------------------------------------
[...truncated 207.89 KB...]
Running org.apache.torque.om.mapper.ObjectListMapperTest
Tests run: 12, Failures: 0, Errors: 0, Skipped: 0, Time elapsed: 0.701 sec - in org.apache.torque.om.mapper.ObjectListMapperTest
Running org.apache.torque.sql.SqlBuilderTest
Tests run: 130, Failures: 0, Errors: 0, Skipped: 0, Time elapsed: 0.561 sec - in org.apache.torque.sql.SqlBuilderTest
Running org.apache.torque.sql.QueryTest
Tests run: 2, Failures: 0, Errors: 0, Skipped: 0, Time elapsed: 0.225 sec - in org.apache.torque.sql.QueryTest
Running org.apache.torque.criteria.CriteriaTest
Tests run: 33, Failures: 0, Errors: 0, Skipped: 0, Time elapsed: 0.531 sec - in org.apache.torque.criteria.CriteriaTest
Running org.apache.torque.criteria.JoinTest
Tests run: 2, Failures: 0, Errors: 0, Skipped: 0, Time elapsed: 0.212 sec - in org.apache.torque.criteria.JoinTest
Running org.apache.torque.criteria.CriterionTest
Tests run: 10, Failures: 0, Errors: 0, Skipped: 0, Time elapsed: 0.231 sec - in org.apache.torque.criteria.CriterionTest
Running org.apache.torque.adapter.DBOracleTest
Tests run: 1, Failures: 0, Errors: 0, Skipped: 0, Time elapsed: 0.04 sec - in org.apache.torque.adapter.DBOracleTest
Running org.apache.torque.avalon.AvalonTest
[WARNING] Unable to find any resource with the name '/componentConfiguration.properties'
[WARNING] Unable to find any resource with the name '/parameters.properties'
[INFO] YaffiContainer ready.
[INFO] YaffiContainer has been disposed.
[WARNING] Unable to find any resource with the name '/componentConfiguration.properties'
[WARNING] Unable to find any resource with the name '/parameters.properties'
[INFO] YaffiContainer ready.
[INFO] YaffiContainer has been disposed.
Tests run: 2, Failures: 0, Errors: 0, Skipped: 0, Time elapsed: 0.345 sec - in org.apache.torque.avalon.AvalonTest
Running org.apache.torque.manager.AbstractBaseManagerTest
Aug 16, 2018 11:13:32 AM org.apache.commons.jcs.engine.control.CompositeCacheManager getInstance
INFO: Instance is null, creating with config [/cache.ccf]
Aug 16, 2018 11:13:32 AM org.apache.commons.jcs.engine.control.CompositeCacheManager configure
INFO: Creating cache manager from config file: /cache.ccf
Aug 16, 2018 11:13:32 AM org.apache.commons.jcs.utils.threadpool.ThreadPoolManager loadConfig
INFO: thread_pool.default PoolConfiguration = useBoundary = [false] boundarySize = [2000] maximumPoolSize = [150] minimumPoolSize = [4] keepAliveTime = [300000] whenBlockedPolicy = [RUN] startUpSize = [4]
Aug 16, 2018 11:13:32 AM org.apache.commons.jcs.engine.control.CompositeCacheManager doConfigure
INFO: Setting default auxiliaries to
Aug 16, 2018 11:13:32 AM org.apache.commons.jcs.engine.control.CompositeCacheManager doConfigure
INFO: setting defaultCompositeCacheAttributes to [ useLateral = true, useRemote = true, useDisk = true, maxObjs = 1000, maxSpoolPerRun = -1, diskUsagePattern = SWAP, spoolChunkSize = 2 ]
Aug 16, 2018 11:13:32 AM org.apache.commons.jcs.engine.control.CompositeCacheConfigurator parseElementAttributes
INFO: No special ElementAttribute class defined for key [jcs.default.elementattributes], using default class.
Aug 16, 2018 11:13:32 AM org.apache.commons.jcs.engine.control.CompositeCacheManager doConfigure
INFO: setting defaultElementAttributes to [ IS_LATERAL = true, IS_SPOOL = true, IS_REMOTE = true, IS_ETERNAL = true, MaxLifeSeconds = -1, IdleTime = -1, CreateTime = 1534418012214, LastAccessTime = 1534418012214, getTimeToLiveSeconds() = -1, createTime = 1534418012214 ]
Aug 16, 2018 11:13:32 AM org.apache.commons.jcs.engine.control.CompositeCacheConfigurator parseElementAttributes
INFO: No special ElementAttribute class defined for key [jcs.region.testCache1.elementattributes], using default class.
Aug 16, 2018 11:13:32 AM org.apache.commons.jcs.engine.memory.AbstractDoubleLinkedListMemoryCache initialize
INFO: initialized MemoryCache for testCache1
Aug 16, 2018 11:13:32 AM org.apache.commons.jcs.engine.control.CompositeCache <init>
INFO: Constructed cache with name [testCache1] and cache attributes [ useLateral = true, useRemote = true, useDisk = true, maxObjs = 1000, maxSpoolPerRun = -1, diskUsagePattern = SWAP, spoolChunkSize = 2 ]
Aug 16, 2018 11:13:32 AM org.apache.commons.jcs.engine.control.CompositeCacheConfigurator parseRegions
INFO: Parsed regions [testCache1]
Aug 16, 2018 11:13:32 AM org.apache.commons.jcs.engine.control.CompositeCacheManager doConfigure
INFO: Finished configuration in 60 ms.
Tests run: 9, Failures: 0, Errors: 0, Skipped: 0, Time elapsed: 0.483 sec - in org.apache.torque.manager.AbstractBaseManagerTest
Running org.apache.torque.manager.MethodResultCacheTest
Aug 16, 2018 11:13:33 AM org.apache.commons.jcs.engine.control.CompositeCacheManager getInstance
INFO: Instance is null, creating with config [/cache.ccf]
Aug 16, 2018 11:13:33 AM org.apache.commons.jcs.engine.control.CompositeCacheManager configure
INFO: Creating cache manager from config file: /cache.ccf
Aug 16, 2018 11:13:33 AM org.apache.commons.jcs.utils.threadpool.ThreadPoolManager loadConfig
INFO: thread_pool.default PoolConfiguration = useBoundary = [false] boundarySize = [2000] maximumPoolSize = [150] minimumPoolSize = [4] keepAliveTime = [300000] whenBlockedPolicy = [RUN] startUpSize = [4]
Aug 16, 2018 11:13:33 AM org.apache.commons.jcs.engine.control.CompositeCacheManager doConfigure
INFO: Setting default auxiliaries to
Aug 16, 2018 11:13:33 AM org.apache.commons.jcs.engine.control.CompositeCacheManager doConfigure
INFO: setting defaultCompositeCacheAttributes to [ useLateral = true, useRemote = true, useDisk = true, maxObjs = 1000, maxSpoolPerRun = -1, diskUsagePattern = SWAP, spoolChunkSize = 2 ]
Aug 16, 2018 11:13:33 AM org.apache.commons.jcs.engine.control.CompositeCacheConfigurator parseElementAttributes
INFO: No special ElementAttribute class defined for key [jcs.default.elementattributes], using default class.
Aug 16, 2018 11:13:33 AM org.apache.commons.jcs.engine.control.CompositeCacheManager doConfigure
INFO: setting defaultElementAttributes to [ IS_LATERAL = true, IS_SPOOL = true, IS_REMOTE = true, IS_ETERNAL = true, MaxLifeSeconds = -1, IdleTime = -1, CreateTime = 1534418013327, LastAccessTime = 1534418013327, getTimeToLiveSeconds() = -1, createTime = 1534418013327 ]
Aug 16, 2018 11:13:33 AM org.apache.commons.jcs.engine.control.CompositeCacheConfigurator parseElementAttributes
INFO: No special ElementAttribute class defined for key [jcs.region.testCache1.elementattributes], using default class.
Aug 16, 2018 11:13:33 AM org.apache.commons.jcs.engine.memory.AbstractDoubleLinkedListMemoryCache initialize
INFO: initialized MemoryCache for testCache1
Aug 16, 2018 11:13:33 AM org.apache.commons.jcs.engine.control.CompositeCache <init>
INFO: Constructed cache with name [testCache1] and cache attributes [ useLateral = true, useRemote = true, useDisk = true, maxObjs = 1000, maxSpoolPerRun = -1, diskUsagePattern = SWAP, spoolChunkSize = 2 ]
Aug 16, 2018 11:13:33 AM org.apache.commons.jcs.engine.control.CompositeCacheConfigurator parseRegions
INFO: Parsed regions [testCache1]
Aug 16, 2018 11:13:33 AM org.apache.commons.jcs.engine.control.CompositeCacheManager doConfigure
INFO: Finished configuration in 52 ms.
Tests run: 3, Failures: 0, Errors: 0, Skipped: 0, Time elapsed: 0.45 sec - in org.apache.torque.manager.MethodResultCacheTest
Aug 16, 2018 11:13:33 AM org.apache.commons.jcs.engine.control.CompositeCacheManager run
INFO: Shutdown hook activated.  Shutdown was not called.  Shutting down JCS.

Results :

Tests run: 365, Failures: 0, Errors: 0, Skipped: 0

[JENKINS] Recording test results
[WARNING] Attempt to (de-)serialize anonymous class hudson.maven.reporters.SurefireArchiver$2; see: https://jenkins.io/redirect/serialization-of-anonymous-classes/
[WARNING] Attempt to (de-)serialize anonymous class hudson.maven.reporters.BuildInfoRecorder$1; see: https://jenkins.io/redirect/serialization-of-anonymous-classes/
[INFO]
[INFO] --- maven-jar-plugin:3.0.0:jar (default-jar) @ torque-runtime ---
[INFO] Building jar: <https://builds.apache.org/job/Torque4-trunk/ws/torque4-trunk/torque-runtime/target/torque-runtime-4.1-SNAPSHOT.jar>
[INFO]
[INFO] --- maven-site-plugin:3.5.1:attach-descriptor (attach-descriptor) @ torque-runtime ---
[INFO]
[INFO] --- maven-source-plugin:3.0.0:jar-no-fork (attach-sources) @ torque-runtime ---
[INFO] Building jar: <https://builds.apache.org/job/Torque4-trunk/ws/torque4-trunk/torque-runtime/target/torque-runtime-4.1-SNAPSHOT-sources.jar>
[INFO]
[INFO] --- apache-rat-plugin:0.11:check (default) @ torque-runtime ---
[INFO] 51 implicit excludes (use -debug for more details).
[INFO] Exclude: velocity.log
[INFO] Exclude: .checkstyle
[INFO] Exclude: checkstyle-cache.ccf
[INFO] Exclude: derby.log
[INFO] Exclude: LICENSE-EDL.txt
[INFO] Exclude: DEPENDENCIES
[INFO] Exclude: torque-test/target/**/*
[INFO] Exclude: torque-test/.classpath
[INFO] Exclude: torque-test/.project
[INFO] Exclude: torque-test/.settings/**
[INFO] Exclude: torque-test/src/main/generated-java/**/*
[INFO] Exclude: torque-test/derby.log
[INFO] 182 resources included (use -debug for more details)
[INFO] Rat check: Summary of files. Unapproved: 0 unknown: 0 generated: 0 approved: 180 licence.
[CHECKSTYLE] No report found for mojo check
[PMD] No report found for mojo check
[INFO]
[INFO] --- dependency-check-maven:3.1.2:check (default) @ torque-runtime ---
[INFO] Skipping dependency-check
[CHECKSTYLE] No report found for mojo check
[INFO]
[PMD] No report found for mojo check[INFO] --- maven-install-plugin:2.5.2:install (default-install) @ torque-runtime ---

[INFO] Installing <https://builds.apache.org/job/Torque4-trunk/ws/torque4-trunk/torque-runtime/target/torque-runtime-4.1-SNAPSHOT.jar> to /home/jenkins/jenkins-slave/maven-repositories/1/org/apache/torque/torque-runtime/4.1-SNAPSHOT/torque-runtime-4.1-SNAPSHOT.jar
[INFO] Installing <https://builds.apache.org/job/Torque4-trunk/ws/torque4-trunk/torque-runtime/pom.xml> to /home/jenkins/jenkins-slave/maven-repositories/1/org/apache/torque/torque-runtime/4.1-SNAPSHOT/torque-runtime-4.1-SNAPSHOT.pom
[INFO] Installing <https://builds.apache.org/job/Torque4-trunk/ws/torque4-trunk/torque-runtime/target/torque-runtime-4.1-SNAPSHOT-sources.jar> to /home/jenkins/jenkins-slave/maven-repositories/1/org/apache/torque/torque-runtime/4.1-SNAPSHOT/torque-runtime-4.1-SNAPSHOT-sources.jar
[INFO]
[INFO] >>> cobertura-maven-plugin:2.3:cobertura (default-cli) > [cobertura]test @ torque-runtime >>>
[INFO]
[INFO] --- maven-remote-resources-plugin:1.5:process (process-resource-bundles) @ torque-runtime ---
[INFO]
[INFO] --- maven-resources-plugin:2.7:resources (default-resources) @ torque-runtime ---
[INFO] Using 'ISO-8859-1' encoding to copy filtered resources.
[INFO] skip non existing resourceDirectory <https://builds.apache.org/job/Torque4-trunk/ws/torque4-trunk/torque-runtime/src/main/resources>
[INFO] Copying 3 resources
[INFO] Copying 3 resources
[INFO]
[INFO] --- maven-compiler-plugin:3.5.1:compile (default-compile) @ torque-runtime ---
[INFO] Nothing to compile - all classes are up to date
[INFO]
[INFO] --- cobertura-maven-plugin:2.3:instrument (default-cli) @ torque-runtime ---
[INFO] Cobertura 1.9.2 - GNU GPL License (NO WARRANTY) - See COPYRIGHT file
Instrumenting 122 files to <https://builds.apache.org/job/Torque4-trunk/ws/torque4-trunk/torque-runtime/target/generated-classes/cobertura>
Cobertura: Saved information on 122 classes.
Instrument time: 637ms

[INFO] Instrumentation was successful.
[INFO]
[INFO] --- maven-resources-plugin:2.7:testResources (default-testResources) @ torque-runtime ---
[INFO] Using 'ISO-8859-1' encoding to copy filtered resources.
[INFO] Copying 5 resources
[INFO] Copying 3 resources
[INFO] Copying 3 resources
[INFO]
[INFO] --- maven-compiler-plugin:3.5.1:testCompile (default-testCompile) @ torque-runtime ---
[INFO] Nothing to compile - all classes are up to date
[INFO]
[INFO] --- maven-surefire-plugin:2.19.1:test (default-test) @ torque-runtime ---

-------------------------------------------------------
 T E S T S
-------------------------------------------------------

Results :

Tests run: 0, Failures: 0, Errors: 0, Skipped: 0

[JENKINS] Recording test results
[INFO] ------------------------------------------------------------------------
[INFO] Reactor Summary:
[INFO]
[INFO] Torque Maven Parent 4.1-SNAPSHOT ................... SUCCESS [01:17 min]
[INFO] Torque Runtime ..................................... FAILURE [ 56.142 s]
[INFO] Torque Generator ................................... SKIPPED
[INFO] Torque Templates ................................... SKIPPED
[INFO] Torque Generator Maven 2 Plugin .................... SKIPPED
[INFO] Torque Generator Ant tasks ......................... SKIPPED
[INFO] Torque Site 4.1-SNAPSHOT ........................... SKIPPED
[INFO] ------------------------------------------------------------------------
[INFO] BUILD FAILURE
[INFO] ------------------------------------------------------------------------
[INFO] Total time: 02:33 min
[INFO] Finished at: 2018-08-16T11:14:02Z
[INFO] ------------------------------------------------------------------------
Waiting for Jenkins to finish collecting data
[ERROR] Failed to execute goal org.apache.maven.plugins:maven-surefire-plugin:2.19.1:test (default-test) on project torque-runtime: Execution default-test of goal org.apache.maven.plugins:maven-surefire-plugin:2.19.1:test failed: There was an error in the forked process
[ERROR] java.lang.VerifyError:
[ERROR] Expecting a stackmap frame at branch target 31
[ERROR] Exception Details:
[ERROR] Location:
[ERROR] org/apache/torque/manager/AbstractBaseManager.getOMInstance()Lorg/apache/torque/om/Persistent; @6: invokestatic
[ERROR] Reason:
[ERROR] Expected stackmap frame at this location.
[ERROR] Bytecode:
[ERROR] 0x0000000: 033c 11ff ff3d b800 2e12 30b6 0034 1100
[ERROR] 0x0000010: 86b6 003a 2ab4 0052 b600 70c0 0072 b0b8
[ERROR] 0x0000020: 002e 1230 b600 3411 0088 b600 3a4e b800
[ERROR] 0x0000030: 2e12 30b6 0034 1100 8ab6 003a bb00 6659
[ERROR] 0x0000040: bb00 7459 b700 7512 77b6 007b 2ab6 007f
[ERROR] 0x0000050: b600 7bb6 0082 2db7 0085 bfb8 002e 1230
[ERROR] 0x0000060: b600 3411 008c b600 3a4e b800 2e12 30b6
[ERROR] 0x0000070: 0034 1100 8eb6 003a bb00 6659 bb00 7459
[ERROR] 0x0000080: b700 7512 87b6 007b 2ab6 007f b600 7bb6
[ERROR] 0x0000090: 0082 2db7 0085 bf
[ERROR] Exception Handler Table:
[ERROR] bci [6, 30] => handler: 31
[ERROR] bci [6, 30] => handler: 91
[ERROR] Stackmap Table:
[ERROR] same_locals_1_stack_item_frame(@45,Object[#104])
[ERROR] same_locals_1_stack_item_frame(@105,Object[#106])
[ERROR]
[ERROR] at java.lang.Class.getDeclaredMethods0(Native Method)
[ERROR] at java.lang.Class.privateGetDeclaredMethods(Class.java:2701)
[ERROR] at java.lang.Class.privateGetMethodRecursive(Class.java:3048)
[ERROR] at java.lang.Class.getMethod0(Class.java:3018)
[ERROR] at java.lang.Class.getMethod(Class.java:1784)
[ERROR] at org.apache.maven.surefire.util.ReflectionUtils.tryGetMethod(ReflectionUtils.java:61)
[ERROR] at org.apache.maven.surefire.common.junit3.JUnit3TestChecker.isSuiteOnly(JUnit3TestChecker.java:64)
[ERROR] at org.apache.maven.surefire.common.junit3.JUnit3TestChecker.isValidJUnit3Test(JUnit3TestChecker.java:59)
[ERROR] at org.apache.maven.surefire.common.junit3.JUnit3TestChecker.accept(JUnit3TestChecker.java:54)
[ERROR] at org.apache.maven.surefire.common.junit4.JUnit4TestChecker.accept(JUnit4TestChecker.java:52)
[ERROR] at org.apache.maven.surefire.util.DefaultScanResult.applyFilter(DefaultScanResult.java:98)
[ERROR] at org.apache.maven.surefire.junit4.JUnit4Provider.scanClassPath(JUnit4Provider.java:311)
[ERROR] at org.apache.maven.surefire.junit4.JUnit4Provider.setTestsToRun(JUnit4Provider.java:191)
[ERROR] at org.apache.maven.surefire.junit4.JUnit4Provider.invoke(JUnit4Provider.java:134)
[ERROR] at org.apache.maven.surefire.booter.ForkedBooter.invokeProviderInSameClassLoader(ForkedBooter.java:290)
[ERROR] at org.apache.maven.surefire.booter.ForkedBooter.runSuitesInProcess(ForkedBooter.java:242)
[ERROR] at org.apache.maven.surefire.booter.ForkedBooter.main(ForkedBooter.java:121)
[ERROR] -> [Help 1]
[ERROR]
[ERROR] To see the full stack trace of the errors, re-run Maven with the -e switch.
[ERROR] Re-run Maven using the -X switch to enable full debug logging.
[ERROR]
[ERROR] For more information about the errors and possible solutions, please read the following articles:
[ERROR] [Help 1] http://cwiki.apache.org/confluence/display/MAVEN/PluginExecutionException
[ERROR]
[ERROR] After correcting the problems, you can resume the build with the command
[ERROR]   mvn <goals> -rf :torque-runtime
[JENKINS] Archiving <https://builds.apache.org/job/Torque4-trunk/ws/torque4-trunk/torque-maven-plugin/pom.xml> to org.apache.torque/torque-maven-plugin/4.1-SNAPSHOT/torque-maven-plugin-4.1-SNAPSHOT.pom
[JENKINS] Archiving <https://builds.apache.org/job/Torque4-trunk/ws/torque4-trunk/pom.xml> to org.apache.torque/torque/4.1-SNAPSHOT/torque-4.1-SNAPSHOT.pom
<https://builds.apache.org/job/Torque4-trunk/ws/torque4-trunk/pom.xml> is not inside <https://builds.apache.org/job/Torque4-trunk/ws/torque4-trunk/torque4-trunk/;> will archive in a separate pass
[JENKINS] Archiving <https://builds.apache.org/job/Torque4-trunk/ws/torque4-trunk/torque-site/pom.xml> to org.apache.torque/torque-site/4.1-SNAPSHOT/torque-site-4.1-SNAPSHOT.pom
[JENKINS] Archiving <https://builds.apache.org/job/Torque4-trunk/ws/torque4-trunk/torque-generator/pom.xml> to org.apache.torque/torque-generator/4.1-SNAPSHOT/torque-generator-4.1-SNAPSHOT.pom
[JENKINS] Archiving <https://builds.apache.org/job/Torque4-trunk/ws/torque4-trunk/torque-templates/pom.xml> to org.apache.torque/torque-templates/4.1-SNAPSHOT/torque-templates-4.1-SNAPSHOT.pom
[JENKINS] Archiving <https://builds.apache.org/job/Torque4-trunk/ws/torque4-trunk/torque-runtime/pom.xml> to org.apache.torque/torque-runtime/4.1-SNAPSHOT/torque-runtime-4.1-SNAPSHOT.pom
[JENKINS] Archiving <https://builds.apache.org/job/Torque4-trunk/ws/torque4-trunk/torque-runtime/target/torque-runtime-4.1-SNAPSHOT.jar> to org.apache.torque/torque-runtime/4.1-SNAPSHOT/torque-runtime-4.1-SNAPSHOT.jar
[JENKINS] Archiving <https://builds.apache.org/job/Torque4-trunk/ws/torque4-trunk/torque-runtime/target/torque-runtime-4.1-SNAPSHOT-sources.jar> to org.apache.torque/torque-runtime/4.1-SNAPSHOT/torque-runtime-4.1-SNAPSHOT-sources.jar
[JENKINS] Archiving <https://builds.apache.org/job/Torque4-trunk/ws/torque4-trunk/torque-ant-tasks/pom.xml> to org.apache.torque/torque-ant-tasks/4.1-SNAPSHOT/torque-ant-tasks-4.1-SNAPSHOT.pom
Sending e-mails to: [hidden email]
channel stopped
[Cobertura] Publishing Cobertura coverage report...


---------------------------------------------------------------------
To unsubscribe, e-mail: [hidden email]
For additional commands, e-mail: [hidden email]

Reply | Threaded
Open this post in threaded view
|

Build failed in Jenkins: Torque4-trunk #583

Apache Jenkins Server-2
See <https://builds.apache.org/job/Torque4-trunk/583/display/redirect?page=changes>

Changes:

[tv] Fix Spotbugs findings

------------------------------------------
[...truncated 221.56 KB...]
INFO: Finished configuration in 37 ms.
Tests run: 3, Failures: 0, Errors: 0, Skipped: 0, Time elapsed: 0.31 sec - in org.apache.torque.manager.MethodResultCacheTest
Aug 24, 2018 5:24:39 PM org.apache.commons.jcs.engine.control.CompositeCacheManager run
INFO: Shutdown hook activated.  Shutdown was not called.  Shutting down JCS.
Aug 24, 2018 5:24:39 PM org.apache.commons.jcs.engine.control.event.ElementEventQueue dispose
INFO: Element event queue destroyed: org.apache.commons.jcs.engine.control.event.ElementEventQueue@11a8b5c1
Running org.apache.torque.manager.AbstractBaseManagerTest
Aug 24, 2018 5:24:39 PM org.apache.commons.jcs.engine.control.CompositeCacheManager getInstance
INFO: Instance is null, creating with config [/cache.ccf]
Aug 24, 2018 5:24:40 PM org.apache.commons.jcs.engine.control.CompositeCacheManager configure
INFO: Creating cache manager from config file: /cache.ccf
Aug 24, 2018 5:24:40 PM org.apache.commons.jcs.utils.threadpool.ThreadPoolManager loadConfig
INFO: thread_pool.default PoolConfiguration = useBoundary = [false] boundarySize = [2000] maximumPoolSize = [150] minimumPoolSize = [4] keepAliveTime = [300000] whenBlockedPolicy = [RUN] startUpSize = [4]
Aug 24, 2018 5:24:40 PM org.apache.commons.jcs.engine.control.CompositeCacheManager doConfigure
INFO: Setting default auxiliaries to
Aug 24, 2018 5:24:40 PM org.apache.commons.jcs.engine.control.CompositeCacheManager doConfigure
INFO: setting defaultCompositeCacheAttributes to [ useLateral = true, useRemote = true, useDisk = true, maxObjs = 1000, maxSpoolPerRun = -1, diskUsagePattern = SWAP, spoolChunkSize = 2 ]
Aug 24, 2018 5:24:40 PM org.apache.commons.jcs.engine.control.CompositeCacheConfigurator parseElementAttributes
INFO: No special ElementAttribute class defined for key [jcs.default.elementattributes], using default class.
Aug 24, 2018 5:24:40 PM org.apache.commons.jcs.engine.control.CompositeCacheManager doConfigure
INFO: setting defaultElementAttributes to [ IS_LATERAL = true, IS_SPOOL = true, IS_REMOTE = true, IS_ETERNAL = true, MaxLifeSeconds = -1, IdleTime = -1, CreateTime = 1535131480046, LastAccessTime = 1535131480046, getTimeToLiveSeconds() = -1, createTime = 1535131480046 ]
Aug 24, 2018 5:24:40 PM org.apache.commons.jcs.engine.control.CompositeCacheConfigurator parseElementAttributes
INFO: No special ElementAttribute class defined for key [jcs.region.testCache1.elementattributes], using default class.
Aug 24, 2018 5:24:40 PM org.apache.commons.jcs.engine.memory.AbstractDoubleLinkedListMemoryCache initialize
INFO: initialized MemoryCache for testCache1
Aug 24, 2018 5:24:40 PM org.apache.commons.jcs.engine.control.CompositeCache <init>
INFO: Constructed cache with name [testCache1] and cache attributes [ useLateral = true, useRemote = true, useDisk = true, maxObjs = 1000, maxSpoolPerRun = -1, diskUsagePattern = SWAP, spoolChunkSize = 2 ]
Aug 24, 2018 5:24:40 PM org.apache.commons.jcs.engine.control.CompositeCacheConfigurator parseRegions
INFO: Parsed regions [testCache1]
Aug 24, 2018 5:24:40 PM org.apache.commons.jcs.engine.control.CompositeCacheManager doConfigure
INFO: Finished configuration in 47 ms.
Tests run: 9, Failures: 0, Errors: 0, Skipped: 0, Time elapsed: 0.328 sec - in org.apache.torque.manager.AbstractBaseManagerTest
Running org.apache.torque.ColumnImplTest
Tests run: 41, Failures: 0, Errors: 0, Skipped: 0, Time elapsed: 0.252 sec - in org.apache.torque.ColumnImplTest
Running org.apache.torque.TorqueInstanceTest
Tests run: 5, Failures: 0, Errors: 0, Skipped: 0, Time elapsed: 0.157 sec - in org.apache.torque.TorqueInstanceTest
Running org.apache.torque.sql.SqlBuilderTest
Tests run: 130, Failures: 0, Errors: 0, Skipped: 0, Time elapsed: 0.41 sec - in org.apache.torque.sql.SqlBuilderTest
Running org.apache.torque.sql.QueryTest
Tests run: 2, Failures: 0, Errors: 0, Skipped: 0, Time elapsed: 0.138 sec - in org.apache.torque.sql.QueryTest
Running org.apache.torque.map.ColumnMapTest
Tests run: 3, Failures: 0, Errors: 0, Skipped: 0, Time elapsed: 0.136 sec - in org.apache.torque.map.ColumnMapTest
Running org.apache.torque.util.UniqueListTest
Tests run: 2, Failures: 0, Errors: 0, Skipped: 0, Time elapsed: 0.027 sec - in org.apache.torque.util.UniqueListTest
Running org.apache.torque.util.BasePeerImplTest
Tests run: 16, Failures: 0, Errors: 0, Skipped: 0, Time elapsed: 0.496 sec - in org.apache.torque.util.BasePeerImplTest
Running org.apache.torque.util.functions.SumTest
Tests run: 4, Failures: 0, Errors: 0, Skipped: 0, Time elapsed: 0.033 sec - in org.apache.torque.util.functions.SumTest
Running org.apache.torque.util.functions.MinTest
Tests run: 4, Failures: 0, Errors: 0, Skipped: 0, Time elapsed: 0.043 sec - in org.apache.torque.util.functions.MinTest
Running org.apache.torque.util.functions.CountTest
Tests run: 4, Failures: 0, Errors: 0, Skipped: 0, Time elapsed: 0.046 sec - in org.apache.torque.util.functions.CountTest
Running org.apache.torque.util.functions.AggregateFunctionTest
Tests run: 12, Failures: 0, Errors: 0, Skipped: 0, Time elapsed: 0.047 sec - in org.apache.torque.util.functions.AggregateFunctionTest
Running org.apache.torque.util.functions.MaxTest
Tests run: 4, Failures: 0, Errors: 0, Skipped: 0, Time elapsed: 0.035 sec - in org.apache.torque.util.functions.MaxTest
Running org.apache.torque.util.functions.AvgTest
Tests run: 4, Failures: 0, Errors: 0, Skipped: 0, Time elapsed: 0.036 sec - in org.apache.torque.util.functions.AvgTest
Running org.apache.torque.util.functions.AbstractFunctionTest
Tests run: 11, Failures: 0, Errors: 0, Skipped: 0, Time elapsed: 0.048 sec - in org.apache.torque.util.functions.AbstractFunctionTest
Running org.apache.torque.util.SummaryHelperTest
Tests run: 1, Failures: 0, Errors: 0, Skipped: 0, Time elapsed: 0.432 sec - in org.apache.torque.util.SummaryHelperTest

Results :

Tests run: 365, Failures: 0, Errors: 0, Skipped: 0

[JENKINS] Recording test results
[WARNING] Attempt to (de-)serialize anonymous class hudson.maven.reporters.SurefireArchiver$2; see: https://jenkins.io/redirect/serialization-of-anonymous-classes/
[WARNING] Attempt to (de-)serialize anonymous class hudson.maven.reporters.BuildInfoRecorder$1; see: https://jenkins.io/redirect/serialization-of-anonymous-classes/
[INFO]
[INFO] --- maven-jar-plugin:3.0.0:jar (default-jar) @ torque-runtime ---
[INFO] Building jar: <https://builds.apache.org/job/Torque4-trunk/ws/torque4-trunk/torque-runtime/target/torque-runtime-4.1-SNAPSHOT.jar>
[INFO]
[INFO] --- maven-site-plugin:3.5.1:attach-descriptor (attach-descriptor) @ torque-runtime ---
[INFO]
[INFO] --- maven-source-plugin:3.0.0:jar-no-fork (attach-sources) @ torque-runtime ---
[INFO] Building jar: <https://builds.apache.org/job/Torque4-trunk/ws/torque4-trunk/torque-runtime/target/torque-runtime-4.1-SNAPSHOT-sources.jar>
[INFO]
[INFO] --- apache-rat-plugin:0.11:check (default) @ torque-runtime ---
[INFO] 51 implicit excludes (use -debug for more details).
[INFO] Exclude: velocity.log
[INFO] Exclude: .checkstyle
[INFO] Exclude: checkstyle-cache.ccf
[INFO] Exclude: derby.log
[INFO] Exclude: LICENSE-EDL.txt
[INFO] Exclude: DEPENDENCIES
[INFO] Exclude: torque-test/target/**/*
[INFO] Exclude: torque-test/.classpath
[INFO] Exclude: torque-test/.project
[INFO] Exclude: torque-test/.settings/**
[INFO] Exclude: torque-test/src/main/generated-java/**/*
[INFO] Exclude: torque-test/derby.log
[INFO] 182 resources included (use -debug for more details)
[INFO] Rat check: Summary of files. Unapproved: 0 unknown: 0 generated: 0 approved: 180 licence.
[CHECKSTYLE] No report found for mojo check
[PMD] No report found for mojo check
[INFO]
[INFO] --- dependency-check-maven:3.1.2:check (default) @ torque-runtime ---
[INFO] Skipping dependency-check
[CHECKSTYLE] No report found for mojo check
[PMD] No report found for mojo check[INFO]

[INFO] --- maven-install-plugin:2.5.2:install (default-install) @ torque-runtime ---
[INFO] Installing <https://builds.apache.org/job/Torque4-trunk/ws/torque4-trunk/torque-runtime/target/torque-runtime-4.1-SNAPSHOT.jar> to /home/jenkins/jenkins-slave/maven-repositories/1/org/apache/torque/torque-runtime/4.1-SNAPSHOT/torque-runtime-4.1-SNAPSHOT.jar
[INFO] Installing <https://builds.apache.org/job/Torque4-trunk/ws/torque4-trunk/torque-runtime/pom.xml> to /home/jenkins/jenkins-slave/maven-repositories/1/org/apache/torque/torque-runtime/4.1-SNAPSHOT/torque-runtime-4.1-SNAPSHOT.pom
[INFO] Installing <https://builds.apache.org/job/Torque4-trunk/ws/torque4-trunk/torque-runtime/target/torque-runtime-4.1-SNAPSHOT-sources.jar> to /home/jenkins/jenkins-slave/maven-repositories/1/org/apache/torque/torque-runtime/4.1-SNAPSHOT/torque-runtime-4.1-SNAPSHOT-sources.jar
[INFO]
[INFO] >>> cobertura-maven-plugin:2.3:cobertura (default-cli) > [cobertura]test @ torque-runtime >>>
[INFO]
[INFO] --- maven-remote-resources-plugin:1.5:process (process-resource-bundles) @ torque-runtime ---
[INFO]
[INFO] --- maven-resources-plugin:2.7:resources (default-resources) @ torque-runtime ---
[INFO] Using 'ISO-8859-1' encoding to copy filtered resources.
[INFO] skip non existing resourceDirectory <https://builds.apache.org/job/Torque4-trunk/ws/torque4-trunk/torque-runtime/src/main/resources>
[INFO] Copying 3 resources
[INFO] Copying 3 resources
[INFO]
[INFO] --- maven-compiler-plugin:3.5.1:compile (default-compile) @ torque-runtime ---
[INFO] Nothing to compile - all classes are up to date
[INFO]
[INFO] --- cobertura-maven-plugin:2.3:instrument (default-cli) @ torque-runtime ---
[INFO] Cobertura 1.9.2 - GNU GPL License (NO WARRANTY) - See COPYRIGHT file
Instrumenting 122 files to <https://builds.apache.org/job/Torque4-trunk/ws/torque4-trunk/torque-runtime/target/generated-classes/cobertura>
[cobertura] WARN  [main] net.sourceforge.cobertura.instrument.Main - Unable to instrument file <https://builds.apache.org/job/Torque4-trunk/ws/torque4-trunk/torque-runtime/target/generated-classes/cobertura/org/apache/torque/util/LargeSelect.class>
java.lang.ArrayIndexOutOfBoundsException: 53883
        at org.objectweb.asm.ClassReader.<init>(Unknown Source)
        at org.objectweb.asm.ClassReader.<init>(Unknown Source)
        at org.objectweb.asm.ClassReader.<init>(Unknown Source)
        at net.sourceforge.cobertura.instrument.Main.addInstrumentationToSingleClass(Main.java:355)
        at net.sourceforge.cobertura.instrument.Main.addInstrumentation(Main.java:416)
        at net.sourceforge.cobertura.instrument.Main.parseArguments(Main.java:492)
        at net.sourceforge.cobertura.instrument.Main.main(Main.java:514)
Cobertura: Saved information on 121 classes.
Instrument time: 514ms

[INFO] Instrumentation was successful.
[INFO]
[INFO] --- maven-resources-plugin:2.7:testResources (default-testResources) @ torque-runtime ---
[INFO] Using 'ISO-8859-1' encoding to copy filtered resources.
[INFO] Copying 5 resources
[INFO] Copying 3 resources
[INFO] Copying 3 resources
[INFO]
[INFO] --- maven-compiler-plugin:3.5.1:testCompile (default-testCompile) @ torque-runtime ---
[INFO] Nothing to compile - all classes are up to date
[INFO]
[INFO] --- maven-surefire-plugin:2.19.1:test (default-test) @ torque-runtime ---

-------------------------------------------------------
 T E S T S
-------------------------------------------------------

Results :

Tests run: 0, Failures: 0, Errors: 0, Skipped: 0

[JENKINS] Recording test results
[INFO] ------------------------------------------------------------------------
[INFO] Reactor Summary:
[INFO]
[INFO] Torque Maven Parent 4.1-SNAPSHOT ................... SUCCESS [01:15 min]
[INFO] Torque Runtime ..................................... FAILURE [ 48.801 s]
[INFO] Torque Generator ................................... SKIPPED
[INFO] Torque Templates ................................... SKIPPED
[INFO] Torque Generator Maven 2 Plugin .................... SKIPPED
[INFO] Torque Generator Ant tasks ......................... SKIPPED
[INFO] Torque Site 4.1-SNAPSHOT ........................... SKIPPED
[INFO] ------------------------------------------------------------------------
[INFO] BUILD FAILURE
[INFO] ------------------------------------------------------------------------
[INFO] Total time: 02:21 min
[INFO] Finished at: 2018-08-24T17:25:16Z
[INFO] ------------------------------------------------------------------------
Waiting for Jenkins to finish collecting data
[ERROR] Failed to execute goal org.apache.maven.plugins:maven-surefire-plugin:2.19.1:test (default-test) on project torque-runtime: Execution default-test of goal org.apache.maven.plugins:maven-surefire-plugin:2.19.1:test failed: There was an error in the forked process
[ERROR] java.lang.VerifyError:
[ERROR] Expecting a stackmap frame at branch target 107
[ERROR] Exception Details:
[ERROR] Location:
[ERROR] org/apache/torque/manager/AbstractBaseManager.dispose()V @32: ifnull
[ERROR] Reason:
[ERROR] Expected stackmap frame at this location.
[ERROR] Bytecode:
[ERROR] 0x0000000: 033c 11ff ff3d b800 2e12 30b6 0034 1101
[ERROR] 0x0000010: 17b6 003a 2ab4 00c0 1101 173c 1100 003d
[ERROR] 0x0000020: c600 4b1b 1101 17a0 001c 1c11 0000 a000
[ERROR] 0x0000030: 15b8 002e 1230 b600 341b 1c04 b600 9c11
[ERROR] 0x0000040: ffff 3db8 002e 1230 b600 3411 0119 b600
[ERROR] 0x0000050: 3a2a b400 c0b6 00d3 b800 2e12 30b6 0034
[ERROR] 0x0000060: 1101 1ab6 003a 2a01 b500 c01c 9b00 15b8
[ERROR] 0x0000070: 002e 1230 b600 341b 1c03 b600 9c11 ffff
[ERROR] 0x0000080: 3db8 002e 1230 b600 3411 011d b600 3a2a
[ERROR] 0x0000090: b400 d511 011d 3c11 0000 3dc6 004b 1b11
[ERROR] 0x00000a0: 011d a000 1c1c 1100 00a0 0015 b800 2e12
[ERROR] 0x00000b0: 30b6 0034 1b1c 04b6 009c 11ff ff3d b800
[ERROR] 0x00000c0: 2e12 30b6 0034 1101 1fb6 003a 2ab4 00d5
[ERROR] 0x00000d0: b600 d8b8 002e 1230 b600 3411 0120 b600
[ERROR] 0x00000e0: 3a2a 01b5 00d5 1c9b 0015 b800 2e12 30b6
[ERROR] 0x00000f0: 0034 1b1c 03b6 009c 11ff ff3d b800 2e12
[ERROR] 0x0000100: 30b6 0034 1101 23b6 003a 2ab4 0043 b600
[ERROR] 0x0000110: d9b8 002e 1230 b600 3411 0124 b600 3a2a
[ERROR] 0x0000120: b400 48b9 00dc 0100 b800 2e12 30b6 0034
[ERROR] 0x0000130: 1101 25b6 003a b1
[ERROR] Stackmap Table:
[ERROR] same_frame_extended(@143)
[ERROR] same_frame_extended(@266)
[ERROR]
[ERROR] at java.lang.Class.getDeclaredMethods0(Native Method)
[ERROR] at java.lang.Class.privateGetDeclaredMethods(Class.java:2701)
[ERROR] at java.lang.Class.privateGetMethodRecursive(Class.java:3048)
[ERROR] at java.lang.Class.getMethod0(Class.java:3018)
[ERROR] at java.lang.Class.getMethod(Class.java:1784)
[ERROR] at org.apache.maven.surefire.util.ReflectionUtils.tryGetMethod(ReflectionUtils.java:61)
[ERROR] at org.apache.maven.surefire.common.junit3.JUnit3TestChecker.isSuiteOnly(JUnit3TestChecker.java:64)
[ERROR] at org.apache.maven.surefire.common.junit3.JUnit3TestChecker.isValidJUnit3Test(JUnit3TestChecker.java:59)
[ERROR] at org.apache.maven.surefire.common.junit3.JUnit3TestChecker.accept(JUnit3TestChecker.java:54)
[ERROR] at org.apache.maven.surefire.common.junit4.JUnit4TestChecker.accept(JUnit4TestChecker.java:52)
[ERROR] at org.apache.maven.surefire.util.DefaultScanResult.applyFilter(DefaultScanResult.java:98)
[ERROR] at org.apache.maven.surefire.junit4.JUnit4Provider.scanClassPath(JUnit4Provider.java:311)
[ERROR] at org.apache.maven.surefire.junit4.JUnit4Provider.setTestsToRun(JUnit4Provider.java:191)
[ERROR] at org.apache.maven.surefire.junit4.JUnit4Provider.invoke(JUnit4Provider.java:134)
[ERROR] at org.apache.maven.surefire.booter.ForkedBooter.invokeProviderInSameClassLoader(ForkedBooter.java:290)
[ERROR] at org.apache.maven.surefire.booter.ForkedBooter.runSuitesInProcess(ForkedBooter.java:242)
[ERROR] at org.apache.maven.surefire.booter.ForkedBooter.main(ForkedBooter.java:121)
[ERROR] -> [Help 1]
[ERROR]
[ERROR] To see the full stack trace of the errors, re-run Maven with the -e switch.
[ERROR] Re-run Maven using the -X switch to enable full debug logging.
[ERROR]
[ERROR] For more information about the errors and possible solutions, please read the following articles:
[ERROR] [Help 1] http://cwiki.apache.org/confluence/display/MAVEN/PluginExecutionException
[ERROR]
[ERROR] After correcting the problems, you can resume the build with the command
[ERROR]   mvn <goals> -rf :torque-runtime
[JENKINS] Archiving <https://builds.apache.org/job/Torque4-trunk/ws/torque4-trunk/torque-maven-plugin/pom.xml> to org.apache.torque/torque-maven-plugin/4.1-SNAPSHOT/torque-maven-plugin-4.1-SNAPSHOT.pom
[JENKINS] Archiving <https://builds.apache.org/job/Torque4-trunk/ws/torque4-trunk/pom.xml> to org.apache.torque/torque/4.1-SNAPSHOT/torque-4.1-SNAPSHOT.pom
<https://builds.apache.org/job/Torque4-trunk/ws/torque4-trunk/pom.xml> is not inside <https://builds.apache.org/job/Torque4-trunk/ws/torque4-trunk/torque4-trunk/;> will archive in a separate pass
[JENKINS] Archiving <https://builds.apache.org/job/Torque4-trunk/ws/torque4-trunk/torque-site/pom.xml> to org.apache.torque/torque-site/4.1-SNAPSHOT/torque-site-4.1-SNAPSHOT.pom
[JENKINS] Archiving <https://builds.apache.org/job/Torque4-trunk/ws/torque4-trunk/torque-generator/pom.xml> to org.apache.torque/torque-generator/4.1-SNAPSHOT/torque-generator-4.1-SNAPSHOT.pom
[JENKINS] Archiving <https://builds.apache.org/job/Torque4-trunk/ws/torque4-trunk/torque-templates/pom.xml> to org.apache.torque/torque-templates/4.1-SNAPSHOT/torque-templates-4.1-SNAPSHOT.pom
[JENKINS] Archiving <https://builds.apache.org/job/Torque4-trunk/ws/torque4-trunk/torque-runtime/pom.xml> to org.apache.torque/torque-runtime/4.1-SNAPSHOT/torque-runtime-4.1-SNAPSHOT.pom
[JENKINS] Archiving <https://builds.apache.org/job/Torque4-trunk/ws/torque4-trunk/torque-runtime/target/torque-runtime-4.1-SNAPSHOT.jar> to org.apache.torque/torque-runtime/4.1-SNAPSHOT/torque-runtime-4.1-SNAPSHOT.jar
[JENKINS] Archiving <https://builds.apache.org/job/Torque4-trunk/ws/torque4-trunk/torque-runtime/target/torque-runtime-4.1-SNAPSHOT-sources.jar> to org.apache.torque/torque-runtime/4.1-SNAPSHOT/torque-runtime-4.1-SNAPSHOT-sources.jar
[JENKINS] Archiving <https://builds.apache.org/job/Torque4-trunk/ws/torque4-trunk/torque-ant-tasks/pom.xml> to org.apache.torque/torque-ant-tasks/4.1-SNAPSHOT/torque-ant-tasks-4.1-SNAPSHOT.pom
Sending e-mails to: [hidden email]
channel stopped
[Cobertura] Publishing Cobertura coverage report...


---------------------------------------------------------------------
To unsubscribe, e-mail: [hidden email]
For additional commands, e-mail: [hidden email]

Reply | Threaded
Open this post in threaded view
|

Build failed in Jenkins: Torque4-trunk #584

Apache Jenkins Server-2
See <https://builds.apache.org/job/Torque4-trunk/584/display/redirect?page=changes>

Changes:

[tv] Practice Java 8

------------------------------------------
[...truncated 179.53 KB...]
[INFO] Downloading from central: https://repo.maven.apache.org/maven2/org/codehaus/mojo/clirr-maven-plugin/2.7/clirr-maven-plugin-2.7.jar
[INFO] Downloaded from central: https://repo.maven.apache.org/maven2/org/codehaus/mojo/clirr-maven-plugin/2.7/clirr-maven-plugin-2.7.jar (73 kB at 2.8 MB/s)
[INFO] Downloading from central: https://repo.maven.apache.org/maven2/org/apache/maven/plugins/maven-jxr-plugin/2.4/maven-jxr-plugin-2.4.pom
[INFO] Downloaded from central: https://repo.maven.apache.org/maven2/org/apache/maven/plugins/maven-jxr-plugin/2.4/maven-jxr-plugin-2.4.pom (7.4 kB at 437 kB/s)
[INFO] Downloading from central: https://repo.maven.apache.org/maven2/org/apache/maven/jxr/jxr/2.4/jxr-2.4.pom
[INFO] Downloaded from central: https://repo.maven.apache.org/maven2/org/apache/maven/jxr/jxr/2.4/jxr-2.4.pom (5.6 kB at 294 kB/s)
[INFO] Downloading from central: https://repo.maven.apache.org/maven2/org/apache/maven/plugins/maven-jxr-plugin/2.4/maven-jxr-plugin-2.4.jar
[INFO] Downloaded from central: https://repo.maven.apache.org/maven2/org/apache/maven/plugins/maven-jxr-plugin/2.4/maven-jxr-plugin-2.4.jar (33 kB at 1.6 MB/s)
[INFO] Downloading from central: https://repo.maven.apache.org/maven2/org/apache/maven/plugins/maven-checkstyle-plugin/2.13/maven-checkstyle-plugin-2.13.pom
[INFO] Downloaded from central: https://repo.maven.apache.org/maven2/org/apache/maven/plugins/maven-checkstyle-plugin/2.13/maven-checkstyle-plugin-2.13.pom (13 kB at 371 kB/s)
[INFO] Downloading from central: https://repo.maven.apache.org/maven2/org/apache/maven/plugins/maven-checkstyle-plugin/2.13/maven-checkstyle-plugin-2.13.jar
[INFO] Downloaded from central: https://repo.maven.apache.org/maven2/org/apache/maven/plugins/maven-checkstyle-plugin/2.13/maven-checkstyle-plugin-2.13.jar (114 kB at 3.8 MB/s)
[INFO]
[INFO] ----------------------< org.apache.torque:torque >----------------------
[INFO] Building Torque Maven Parent 4.1-SNAPSHOT                          [1/7]
[INFO] --------------------------------[ pom ]---------------------------------
[INFO]
[INFO] --- maven-clean-plugin:3.0.0:clean (default-clean) @ torque ---
[INFO]
[INFO] --- maven-remote-resources-plugin:1.5:process (process-resource-bundles) @ torque ---
[INFO]
[INFO] --- maven-site-plugin:3.5.1:attach-descriptor (attach-descriptor) @ torque ---
[INFO]
[INFO] --- maven-source-plugin:3.0.0:jar-no-fork (attach-sources) @ torque ---
[INFO]
[INFO] --- apache-rat-plugin:0.11:check (default) @ torque ---
[INFO] Downloading from central: https://repo.maven.apache.org/maven2/org/apache/rat/apache-rat-core/0.11/apache-rat-core-0.11.pom
[INFO] Downloaded from central: https://repo.maven.apache.org/maven2/org/apache/rat/apache-rat-core/0.11/apache-rat-core-0.11.pom (4.3 kB at 228 kB/s)
[INFO] Downloading from central: https://repo.maven.apache.org/maven2/org/apache/rat/apache-rat-core/0.11/apache-rat-core-0.11.jar
[INFO] Downloaded from central: https://repo.maven.apache.org/maven2/org/apache/rat/apache-rat-core/0.11/apache-rat-core-0.11.jar (118 kB at 4.4 MB/s)
[INFO] 57 implicit excludes (use -debug for more details).
[INFO] Exclude: velocity.log
[INFO] Exclude: .checkstyle
[INFO] Exclude: checkstyle-cache.ccf
[INFO] Exclude: derby.log
[INFO] Exclude: LICENSE-EDL.txt
[INFO] Exclude: DEPENDENCIES
[INFO] Exclude: torque-test/target/**/*
[INFO] Exclude: torque-test/.classpath
[INFO] Exclude: torque-test/.project
[INFO] Exclude: torque-test/.settings/**
[INFO] Exclude: torque-test/src/main/generated-java/**/*
[INFO] Exclude: torque-test/derby.log
[INFO] 121 resources included (use -debug for more details)
[INFO] Rat check: Summary of files. Unapproved: 0 unknown: 0 generated: 0 approved: 116 licence.
[WARNING] Attempt to (de-)serialize anonymous class hudson.plugins.analysis.core.HealthAwareReporter$2; see: https://jenkins.io/redirect/serialization-of-anonymous-classes/
[WARNING] Attempt to (de-)serialize anonymous class hudson.plugins.analysis.core.HealthAwareReporter$3; see: https://jenkins.io/redirect/serialization-of-anonymous-classes/
[CHECKSTYLE] No report found for mojo check
[PMD] No report found for mojo check
[INFO]
[INFO] --- dependency-check-maven:3.1.2:check (default) @ torque ---
[INFO] Downloading from central: https://repo.maven.apache.org/maven2/org/owasp/dependency-check-core/3.1.2/dependency-check-core-3.1.2.pom
[INFO] Downloaded from central: https://repo.maven.apache.org/maven2/org/owasp/dependency-check-core/3.1.2/dependency-check-core-3.1.2.pom (23 kB at 1.1 MB/s)
[INFO] Downloading from central: https://repo.maven.apache.org/maven2/org/owasp/dependency-check-utils/3.1.2/dependency-check-utils-3.1.2.pom
[INFO] Downloaded from central: https://repo.maven.apache.org/maven2/org/owasp/dependency-check-utils/3.1.2/dependency-check-utils-3.1.2.pom (2.3 kB at 141 kB/s)
[INFO] Downloading from central: https://repo.maven.apache.org/maven2/org/owasp/dependency-check-core/3.1.2/dependency-check-core-3.1.2.jar
[INFO] Downloading from central: https://repo.maven.apache.org/maven2/org/owasp/dependency-check-utils/3.1.2/dependency-check-utils-3.1.2.jar
[INFO] Downloaded from central: https://repo.maven.apache.org/maven2/org/owasp/dependency-check-utils/3.1.2/dependency-check-utils-3.1.2.jar (35 kB at 1.8 MB/s)
[INFO] Downloaded from central: https://repo.maven.apache.org/maven2/org/owasp/dependency-check-core/3.1.2/dependency-check-core-3.1.2.jar (602 kB at 7.3 MB/s)
[INFO] Skipping dependency-check
[CHECKSTYLE] No report found for mojo check
[PMD] No report found for mojo check
[INFO]
[INFO] --- maven-install-plugin:2.5.2:install (default-install) @ torque ---
[INFO] Installing <https://builds.apache.org/job/Torque4-trunk/ws/torque4-trunk/pom.xml> to /home/jenkins/jenkins-slave/maven-repositories/1/org/apache/torque/torque/4.1-SNAPSHOT/torque-4.1-SNAPSHOT.pom
[INFO]
[INFO] >>> cobertura-maven-plugin:2.3:cobertura (default-cli) > [cobertura]test @ torque >>>
[INFO]
[INFO] --- maven-remote-resources-plugin:1.5:process (process-resource-bundles) @ torque ---
[INFO]
[INFO] --- cobertura-maven-plugin:2.3:instrument (default-cli) @ torque ---
[INFO] Downloading from central: https://repo.maven.apache.org/maven2/net/sourceforge/cobertura/cobertura/1.9.2/cobertura-1.9.2.pom
[INFO] Downloaded from central: https://repo.maven.apache.org/maven2/net/sourceforge/cobertura/cobertura/1.9.2/cobertura-1.9.2.pom (1.5 kB at 57 kB/s)
[INFO] Downloading from central: https://repo.maven.apache.org/maven2/asm/asm-tree/3.0/asm-tree-3.0.pom
[INFO] Downloaded from central: https://repo.maven.apache.org/maven2/asm/asm-tree/3.0/asm-tree-3.0.pom (499 B at 36 kB/s)
[INFO] Downloading from central: https://repo.maven.apache.org/maven2/log4j/log4j/1.2.9/log4j-1.2.9.pom
[INFO] Downloaded from central: https://repo.maven.apache.org/maven2/log4j/log4j/1.2.9/log4j-1.2.9.pom (144 B at 11 kB/s)
[INFO] Downloading from central: https://repo.maven.apache.org/maven2/net/sourceforge/cobertura/cobertura-runtime/1.9.2/cobertura-runtime-1.9.2.pom
[INFO] Downloaded from central: https://repo.maven.apache.org/maven2/net/sourceforge/cobertura/cobertura-runtime/1.9.2/cobertura-runtime-1.9.2.pom (1.3 kB at 56 kB/s)
[INFO] Downloading from central: https://repo.maven.apache.org/maven2/urbanophile/java-getopt/1.0.9/java-getopt-1.0.9.pom
[INFO] Downloaded from central: https://repo.maven.apache.org/maven2/urbanophile/java-getopt/1.0.9/java-getopt-1.0.9.pom (157 B at 12 kB/s)
[INFO] Downloading from central: https://repo.maven.apache.org/maven2/net/sourceforge/cobertura/cobertura/1.9.2/cobertura-1.9.2.jar
[INFO] Downloading from central: https://repo.maven.apache.org/maven2/asm/asm-tree/3.0/asm-tree-3.0.jar
[INFO] Downloading from central: https://repo.maven.apache.org/maven2/log4j/log4j/1.2.9/log4j-1.2.9.jar
[INFO] Downloading from central: https://repo.maven.apache.org/maven2/urbanophile/java-getopt/1.0.9/java-getopt-1.0.9.jar
[INFO] Downloaded from central: https://repo.maven.apache.org/maven2/asm/asm-tree/3.0/asm-tree-3.0.jar (22 kB at 978 kB/s)
[INFO] Downloaded from central: https://repo.maven.apache.org/maven2/urbanophile/java-getopt/1.0.9/java-getopt-1.0.9.jar (54 kB at 1.2 MB/s)
[INFO] Downloaded from central: https://repo.maven.apache.org/maven2/net/sourceforge/cobertura/cobertura/1.9.2/cobertura-1.9.2.jar (230 kB at 4.9 MB/s)
[INFO] Downloaded from central: https://repo.maven.apache.org/maven2/log4j/log4j/1.2.9/log4j-1.2.9.jar (352 kB at 4.5 MB/s)
[INFO] Not executing cobertura:instrument as the project is not a Java classpath-capable package
[INFO]
[INFO] <<< cobertura-maven-plugin:2.3:cobertura (default-cli) < [cobertura]test @ torque <<<
[INFO]
[INFO]
[INFO] --- cobertura-maven-plugin:2.3:cobertura (default-cli) @ torque ---
[INFO] Not executing cobertura:report as the cobertura data file (<https://builds.apache.org/job/Torque4-trunk/ws/torque4-trunk/target/cobertura/cobertura.ser)> could not be found
[INFO]
[INFO] --- findbugs-maven-plugin:3.0.3:findbugs (default-cli) @ torque ---
[INFO] Downloading from central: https://repo.maven.apache.org/maven2/org/codehaus/groovy/groovy-all/2.4.3/groovy-all-2.4.3.pom
[INFO] Downloaded from central: https://repo.maven.apache.org/maven2/org/codehaus/groovy/groovy-all/2.4.3/groovy-all-2.4.3.pom (18 kB at 920 kB/s)
[INFO] Downloading from central: https://repo.maven.apache.org/maven2/org/codehaus/groovy/groovy-all/2.4.3/groovy-all-2.4.3.jar
[INFO] Downloaded from central: https://repo.maven.apache.org/maven2/org/codehaus/groovy/groovy-all/2.4.3/groovy-all-2.4.3.jar (7.0 MB at 14 MB/s)
[INFO]
[INFO] --- maven-checkstyle-plugin:2.13:checkstyle (default-cli) @ torque ---
[FINDBUGS] No report found for mojo findbugs
[INFO] Downloading from central: https://repo.maven.apache.org/maven2/com/puppycrawl/tools/checkstyle/5.7/checkstyle-5.7.pom
[INFO] Downloaded from central: https://repo.maven.apache.org/maven2/com/puppycrawl/tools/checkstyle/5.7/checkstyle-5.7.pom (25 kB at 1.1 MB/s)
[INFO] Downloading from central: https://repo.maven.apache.org/maven2/com/google/guava/guava-jdk5/14.0.1/guava-jdk5-14.0.1.pom
[INFO] Downloaded from central: https://repo.maven.apache.org/maven2/com/google/guava/guava-jdk5/14.0.1/guava-jdk5-14.0.1.pom (6.4 kB at 377 kB/s)
[INFO] Downloading from central: https://repo.maven.apache.org/maven2/com/google/guava/guava-parent-jdk5/14.0.1/guava-parent-jdk5-14.0.1.pom
[INFO] Downloaded from central: https://repo.maven.apache.org/maven2/com/google/guava/guava-parent-jdk5/14.0.1/guava-parent-jdk5-14.0.1.pom (3.0 kB at 188 kB/s)
[INFO] Downloading from central: https://repo.maven.apache.org/maven2/com/puppycrawl/tools/checkstyle/5.7/checkstyle-5.7.jar
[INFO] Downloading from central: https://repo.maven.apache.org/maven2/com/google/guava/guava-jdk5/14.0.1/guava-jdk5-14.0.1.jar
[INFO] Downloaded from central: https://repo.maven.apache.org/maven2/com/puppycrawl/tools/checkstyle/5.7/checkstyle-5.7.jar (660 kB at 10 MB/s)
[INFO] Downloaded from central: https://repo.maven.apache.org/maven2/com/google/guava/guava-jdk5/14.0.1/guava-jdk5-14.0.1.jar (2.0 MB at 11 MB/s)
[INFO]
[CHECKSTYLE] Parsing file <https://builds.apache.org/job/Torque4-trunk/ws/torque4-trunk/target/checkstyle-result.xml>
[CHECKSTYLE] Successfully parsed file <https://builds.apache.org/job/Torque4-trunk/ws/torque4-trunk/target/checkstyle-result.xml> of module Torque Maven Parent with 0 unique warnings and 0 duplicates.
[WARNING] Attempt to (de-)serialize anonymous class hudson.plugins.analysis.core.HealthAwareReporter$1; see: https://jenkins.io/redirect/serialization-of-anonymous-classes/
[CHECKSTYLE] Computing warning deltas based on reference build #583
[INFO]
[INFO] --- maven-pmd-plugin:3.2:pmd (default-cli) @ torque ---
[INFO] Downloading from central: https://repo.maven.apache.org/maven2/net/sourceforge/pmd/pmd/5.1.2/pmd-5.1.2.pom
[INFO] Downloaded from central: https://repo.maven.apache.org/maven2/net/sourceforge/pmd/pmd/5.1.2/pmd-5.1.2.pom (37 kB at 853 kB/s)
[INFO] Downloading from central: https://repo.maven.apache.org/maven2/org/apache/ant/ant-testutil/1.7.1/ant-testutil-1.7.1.pom
[INFO] Downloaded from central: https://repo.maven.apache.org/maven2/org/apache/ant/ant-testutil/1.7.1/ant-testutil-1.7.1.pom (2.8 kB at 126 kB/s)
[INFO] Downloading from central: https://repo.maven.apache.org/maven2/xml-apis/xml-apis/1.3.02/xml-apis-1.3.02.pom
[INFO] Downloaded from central: https://repo.maven.apache.org/maven2/xml-apis/xml-apis/1.3.02/xml-apis-1.3.02.pom (357 B at 21 kB/s)
[INFO] Downloading from central: https://repo.maven.apache.org/maven2/xom/xom/1.0/xom-1.0.pom
[INFO] Downloaded from central: https://repo.maven.apache.org/maven2/xom/xom/1.0/xom-1.0.pom (1.6 kB at 105 kB/s)
[INFO] Downloading from central: https://repo.maven.apache.org/maven2/org/mozilla/rhino/1.7R3/rhino-1.7R3.pom
[INFO] Downloaded from central: https://repo.maven.apache.org/maven2/org/mozilla/rhino/1.7R3/rhino-1.7R3.pom (1.4 kB at 84 kB/s)
[INFO] Downloading from central: https://repo.maven.apache.org/maven2/net/sourceforge/pmd/pmd/5.1.2/pmd-5.1.2.jar
[INFO] Downloading from central: https://repo.maven.apache.org/maven2/org/apache/ant/ant-testutil/1.7.1/ant-testutil-1.7.1.jar
[INFO] Downloading from central: https://repo.maven.apache.org/maven2/xml-apis/xml-apis/1.3.02/xml-apis-1.3.02.jar
[INFO] Downloading from central: https://repo.maven.apache.org/maven2/xom/xom/1.0/xom-1.0.jar
[INFO] Downloading from central: https://repo.maven.apache.org/maven2/org/mozilla/rhino/1.7R3/rhino-1.7R3.jar
[INFO] Downloaded from central: https://repo.maven.apache.org/maven2/org/apache/ant/ant-testutil/1.7.1/ant-testutil-1.7.1.jar (15 kB at 830 kB/s)
[INFO] Downloading from central: https://repo.maven.apache.org/maven2/junit/junit/4.4/junit-4.4.jar
[INFO] Downloaded from central: https://repo.maven.apache.org/maven2/xom/xom/1.0/xom-1.0.jar (109 kB at 4.4 MB/s)
[INFO] Downloaded from central: https://repo.maven.apache.org/maven2/xml-apis/xml-apis/1.3.02/xml-apis-1.3.02.jar (194 kB at 5.7 MB/s)
[INFO] Downloaded from central: https://repo.maven.apache.org/maven2/junit/junit/4.4/junit-4.4.jar (161 kB at 3.6 MB/s)
[INFO] Downloaded from central: https://repo.maven.apache.org/maven2/net/sourceforge/pmd/pmd/5.1.2/pmd-5.1.2.jar (2.1 MB at 12 MB/s)
[INFO] Downloaded from central: https://repo.maven.apache.org/maven2/org/mozilla/rhino/1.7R3/rhino-1.7R3.jar (1.1 MB at 6.2 MB/s)
[PMD] No report found for mojo pmd
[INFO]
[INFO] --- maven-pmd-plugin:3.2:cpd (default-cli) @ torque ---
[DRY] No report found for mojo cpd
[WARNING] Attempt to (de-)serialize anonymous class hudson.maven.reporters.MavenArtifactArchiver$2; see: https://jenkins.io/redirect/serialization-of-anonymous-classes/
[WARNING] Attempt to (de-)serialize anonymous class hudson.maven.reporters.MavenFingerprinter$1; see: https://jenkins.io/redirect/serialization-of-anonymous-classes/
[INFO]
[INFO] ------------------< org.apache.torque:torque-runtime >------------------
[INFO] Building Torque Runtime 4.1-SNAPSHOT                               [2/7]
[INFO] --------------------------------[ jar ]---------------------------------
[INFO] Downloading from central: https://repo.maven.apache.org/maven2/org/apache/commons/commons-jcs-core/2.2/commons-jcs-core-2.2.pom
[INFO] Downloaded from central: https://repo.maven.apache.org/maven2/org/apache/commons/commons-jcs-core/2.2/commons-jcs-core-2.2.pom (6.1 kB at 362 kB/s)
[INFO] Downloading from central: https://repo.maven.apache.org/maven2/org/apache/commons/commons-jcs/2.2/commons-jcs-2.2.pom
[INFO] Downloaded from central: https://repo.maven.apache.org/maven2/org/apache/commons/commons-jcs/2.2/commons-jcs-2.2.pom (19 kB at 1.2 MB/s)
[INFO] Downloading from central: https://repo.maven.apache.org/maven2/org/apache/fulcrum/fulcrum-testcontainer/1.0.7/fulcrum-testcontainer-1.0.7.pom
[INFO] Downloaded from central: https://repo.maven.apache.org/maven2/org/apache/fulcrum/fulcrum-testcontainer/1.0.7/fulcrum-testcontainer-1.0.7.pom (4.4 kB at 243 kB/s)
[INFO] Downloading from central: https://repo.maven.apache.org/maven2/org/apache/turbine/turbine-parent/3/turbine-parent-3.pom
[INFO] Downloaded from central: https://repo.maven.apache.org/maven2/org/apache/turbine/turbine-parent/3/turbine-parent-3.pom (20 kB at 977 kB/s)
[INFO] Downloading from central: https://repo.maven.apache.org/maven2/org/apache/fulcrum/fulcrum-yaafi/1.0.6/fulcrum-yaafi-1.0.6.pom
[INFO] Downloaded from central: https://repo.maven.apache.org/maven2/org/apache/fulcrum/fulcrum-yaafi/1.0.6/fulcrum-yaafi-1.0.6.pom (3.1 kB at 161 kB/s)
[INFO] Downloading from central: https://repo.maven.apache.org/maven2/org/apache/fulcrum/fulcrum-parent/1/fulcrum-parent-1.pom
[INFO] Downloaded from central: https://repo.maven.apache.org/maven2/org/apache/fulcrum/fulcrum-parent/1/fulcrum-parent-1.pom (19 kB at 1.1 MB/s)
[INFO] Downloading from central: https://repo.maven.apache.org/maven2/org/mockito/mockito-all/1.9.0/mockito-all-1.9.0.pom
[INFO] Downloaded from central: https://repo.maven.apache.org/maven2/org/mockito/mockito-all/1.9.0/mockito-all-1.9.0.pom (1.0 kB at 72 kB/s)
[INFO] Downloading from central: https://repo.maven.apache.org/maven2/org/apache/commons/commons-jcs-core/2.2/commons-jcs-core-2.2.jar
[INFO] Downloading from central: https://repo.maven.apache.org/maven2/org/apache/fulcrum/fulcrum-testcontainer/1.0.7/fulcrum-testcontainer-1.0.7.jar
[INFO] Downloading from central: https://repo.maven.apache.org/maven2/org/apache/fulcrum/fulcrum-yaafi/1.0.6/fulcrum-yaafi-1.0.6.jar
[INFO] Downloading from central: https://repo.maven.apache.org/maven2/org/mockito/mockito-all/1.9.0/mockito-all-1.9.0.jar
[INFO] Downloaded from central: https://repo.maven.apache.org/maven2/org/apache/fulcrum/fulcrum-testcontainer/1.0.7/fulcrum-testcontainer-1.0.7.jar (16 kB at 910 kB/s)
[INFO] Downloaded from central: https://repo.maven.apache.org/maven2/org/apache/fulcrum/fulcrum-yaafi/1.0.6/fulcrum-yaafi-1.0.6.jar (130 kB at 5.2 MB/s)
[INFO] Downloaded from central: https://repo.maven.apache.org/maven2/org/apache/commons/commons-jcs-core/2.2/commons-jcs-core-2.2.jar (535 kB at 9.4 MB/s)
[INFO] Downloaded from central: https://repo.maven.apache.org/maven2/org/mockito/mockito-all/1.9.0/mockito-all-1.9.0.jar (1.5 MB at 12 MB/s)
[INFO]
[INFO] --- maven-clean-plugin:3.0.0:clean (default-clean) @ torque-runtime ---
[INFO]
[INFO] --- maven-remote-resources-plugin:1.5:process (process-resource-bundles) @ torque-runtime ---
[INFO]
[INFO] --- maven-resources-plugin:2.7:resources (default-resources) @ torque-runtime ---
[INFO] Using 'ISO-8859-1' encoding to copy filtered resources.
[INFO] skip non existing resourceDirectory <https://builds.apache.org/job/Torque4-trunk/ws/torque4-trunk/torque-runtime/src/main/resources>
[INFO] Copying 3 resources
[INFO]
[INFO] --- maven-compiler-plugin:3.5.1:compile (default-compile) @ torque-runtime ---
[INFO] Changes detected - recompiling the module!
[INFO] Compiling 119 source files to <https://builds.apache.org/job/Torque4-trunk/ws/torque4-trunk/torque-runtime/target/classes>
[INFO] Some messages have been simplified; recompile with -Xdiags:verbose to get full output
[INFO] -------------------------------------------------------------
[ERROR] COMPILATION ERROR :
[INFO] -------------------------------------------------------------
[ERROR] <https://builds.apache.org/job/Torque4-trunk/ws/torque4-trunk/torque-runtime/src/main/java/org/apache/torque/TorqueInstance.java>:[860,35] incompatible types: invalid method reference
    method dispose in class org.apache.torque.manager.AbstractBaseManager<T> cannot be applied to given types
      required: no arguments
      found: org.apache.torque.manager.AbstractBaseManager<?>
      reason: actual and formal argument lists differ in length
[ERROR] <https://builds.apache.org/job/Torque4-trunk/ws/torque4-trunk/torque-runtime/src/main/java/org/apache/torque/TorqueInstance.java>:[860,54] invalid method reference
  non-static method dispose() cannot be referenced from a static context
[INFO] 2 errors
[INFO] -------------------------------------------------------------
[INFO] ------------------------------------------------------------------------
[INFO] Reactor Summary:
[INFO]
[INFO] Torque Maven Parent 4.1-SNAPSHOT ................... SUCCESS [01:27 min]
[INFO] Torque Runtime ..................................... FAILURE [  7.660 s]
[INFO] Torque Generator ................................... SKIPPED
[INFO] Torque Templates ................................... SKIPPED
[INFO] Torque Generator Maven 2 Plugin .................... SKIPPED
[INFO] Torque Generator Ant tasks ......................... SKIPPED
[INFO] Torque Site 4.1-SNAPSHOT ........................... SKIPPED
[INFO] ------------------------------------------------------------------------
[INFO] BUILD FAILURE
[INFO] ------------------------------------------------------------------------
[INFO] Total time: 01:53 min
[INFO] Finished at: 2018-08-24T18:24:51Z
[INFO] ------------------------------------------------------------------------
Waiting for Jenkins to finish collecting data
[ERROR] Failed to execute goal org.apache.maven.plugins:maven-compiler-plugin:3.5.1:compile (default-compile) on project torque-runtime: Compilation failure: Compilation failure:
[ERROR] <https://builds.apache.org/job/Torque4-trunk/ws/torque4-trunk/torque-runtime/src/main/java/org/apache/torque/TorqueInstance.java>:[860,35] incompatible types: invalid method reference
[ERROR] method dispose in class org.apache.torque.manager.AbstractBaseManager<T> cannot be applied to given types
[ERROR] required: no arguments
[ERROR] found: org.apache.torque.manager.AbstractBaseManager<?>
[ERROR] reason: actual and formal argument lists differ in length
[ERROR] <https://builds.apache.org/job/Torque4-trunk/ws/torque4-trunk/torque-runtime/src/main/java/org/apache/torque/TorqueInstance.java>:[860,54] invalid method reference
[ERROR] non-static method dispose() cannot be referenced from a static context
[ERROR] -> [Help 1]
[ERROR]
[ERROR] To see the full stack trace of the errors, re-run Maven with the -e switch.
[ERROR] Re-run Maven using the -X switch to enable full debug logging.
[ERROR]
[ERROR] For more information about the errors and possible solutions, please read the following articles:
[ERROR] [Help 1] http://cwiki.apache.org/confluence/display/MAVEN/MojoFailureException
[ERROR]
[ERROR] After correcting the problems, you can resume the build with the command
[ERROR]   mvn <goals> -rf :torque-runtime
[JENKINS] Archiving <https://builds.apache.org/job/Torque4-trunk/ws/torque4-trunk/torque-maven-plugin/pom.xml> to org.apache.torque/torque-maven-plugin/4.1-SNAPSHOT/torque-maven-plugin-4.1-SNAPSHOT.pom
[JENKINS] Archiving <https://builds.apache.org/job/Torque4-trunk/ws/torque4-trunk/pom.xml> to org.apache.torque/torque/4.1-SNAPSHOT/torque-4.1-SNAPSHOT.pom
<https://builds.apache.org/job/Torque4-trunk/ws/torque4-trunk/pom.xml> is not inside <https://builds.apache.org/job/Torque4-trunk/ws/torque4-trunk/torque4-trunk/;> will archive in a separate pass
[JENKINS] Archiving <https://builds.apache.org/job/Torque4-trunk/ws/torque4-trunk/torque-site/pom.xml> to org.apache.torque/torque-site/4.1-SNAPSHOT/torque-site-4.1-SNAPSHOT.pom
[JENKINS] Archiving <https://builds.apache.org/job/Torque4-trunk/ws/torque4-trunk/torque-generator/pom.xml> to org.apache.torque/torque-generator/4.1-SNAPSHOT/torque-generator-4.1-SNAPSHOT.pom
[JENKINS] Archiving <https://builds.apache.org/job/Torque4-trunk/ws/torque4-trunk/torque-templates/pom.xml> to org.apache.torque/torque-templates/4.1-SNAPSHOT/torque-templates-4.1-SNAPSHOT.pom
[JENKINS] Archiving <https://builds.apache.org/job/Torque4-trunk/ws/torque4-trunk/torque-runtime/pom.xml> to org.apache.torque/torque-runtime/4.1-SNAPSHOT/torque-runtime-4.1-SNAPSHOT.pom
[JENKINS] Archiving <https://builds.apache.org/job/Torque4-trunk/ws/torque4-trunk/torque-ant-tasks/pom.xml> to org.apache.torque/torque-ant-tasks/4.1-SNAPSHOT/torque-ant-tasks-4.1-SNAPSHOT.pom
Sending e-mails to: [hidden email]
channel stopped
[Cobertura] Publishing Cobertura coverage report...


---------------------------------------------------------------------
To unsubscribe, e-mail: [hidden email]
For additional commands, e-mail: [hidden email]

Reply | Threaded
Open this post in threaded view
|

Jenkins build is unstable: Torque4-trunk #585

Apache Jenkins Server-2
See <https://builds.apache.org/job/Torque4-trunk/585/display/redirect?page=changes>


---------------------------------------------------------------------
To unsubscribe, e-mail: [hidden email]
For additional commands, e-mail: [hidden email]

Reply | Threaded
Open this post in threaded view
|

Jenkins build is still unstable: Torque4-trunk #586

Apache Jenkins Server-2
See <https://builds.apache.org/job/Torque4-trunk/586/display/redirect?page=changes>


---------------------------------------------------------------------
To unsubscribe, e-mail: [hidden email]
For additional commands, e-mail: [hidden email]

Reply | Threaded
Open this post in threaded view
|

Jenkins build is still unstable: Torque4-trunk #587

Apache Jenkins Server-2
See <https://builds.apache.org/job/Torque4-trunk/587/display/redirect?page=changes>


---------------------------------------------------------------------
To unsubscribe, e-mail: [hidden email]
For additional commands, e-mail: [hidden email]

Reply | Threaded
Open this post in threaded view
|

Jenkins build is still unstable: Torque4-trunk #588

Apache Jenkins Server-2
See <https://builds.apache.org/job/Torque4-trunk/588/display/redirect?page=changes>


---------------------------------------------------------------------
To unsubscribe, e-mail: [hidden email]
For additional commands, e-mail: [hidden email]

Reply | Threaded
Open this post in threaded view
|

Jenkins build is still unstable: Torque4-trunk #589

Apache Jenkins Server-2
See <https://builds.apache.org/job/Torque4-trunk/589/display/redirect?page=changes>


---------------------------------------------------------------------
To unsubscribe, e-mail: [hidden email]
For additional commands, e-mail: [hidden email]

Reply | Threaded
Open this post in threaded view
|

Jenkins build is still unstable: Torque4-trunk #590

Apache Jenkins Server-2
See <https://builds.apache.org/job/Torque4-trunk/590/display/redirect?page=changes>


---------------------------------------------------------------------
To unsubscribe, e-mail: [hidden email]
For additional commands, e-mail: [hidden email]

Reply | Threaded
Open this post in threaded view
|

Jenkins build is still unstable: Torque4-trunk #591

Apache Jenkins Server-2
See <https://builds.apache.org/job/Torque4-trunk/591/display/redirect?page=changes>


---------------------------------------------------------------------
To unsubscribe, e-mail: [hidden email]
For additional commands, e-mail: [hidden email]

Reply | Threaded
Open this post in threaded view
|

Jenkins build is still unstable: Torque4-trunk #592

Apache Jenkins Server-2
See <https://builds.apache.org/job/Torque4-trunk/592/display/redirect?page=changes>


---------------------------------------------------------------------
To unsubscribe, e-mail: [hidden email]
For additional commands, e-mail: [hidden email]

Reply | Threaded
Open this post in threaded view
|

Jenkins build is still unstable: Torque4-trunk #593

Apache Jenkins Server-2
See <https://builds.apache.org/job/Torque4-trunk/593/display/redirect?page=changes>


---------------------------------------------------------------------
To unsubscribe, e-mail: [hidden email]
For additional commands, e-mail: [hidden email]

Reply | Threaded
Open this post in threaded view
|

Jenkins build is still unstable: Torque4-trunk #594

Apache Jenkins Server-2
See <https://builds.apache.org/job/Torque4-trunk/594/display/redirect?page=changes>


---------------------------------------------------------------------
To unsubscribe, e-mail: [hidden email]
For additional commands, e-mail: [hidden email]

12