Build failed in Jenkins: Torque4-trunk » Torque Runtime #576

classic Classic list List threaded Threaded
16 messages Options
Reply | Threaded
Open this post in threaded view
|

Build failed in Jenkins: Torque4-trunk » Torque Runtime #576

Apache Jenkins Server-2
See <https://builds.apache.org/job/Torque4-trunk/org.apache.torque$torque-runtime/576/display/redirect?page=changes>

Changes:

[tv] Get rid of synchronization in getDatabaseMap()
Fix bad column names for IDBroker

------------------------------------------
[...truncated 16.69 KB...]
[DEBUG] Disposable.dispose() for TorqueComponent
[DEBUG] dispose()
[DEBUG] Disposing the service TorqueComponent
[DEBUG] All services are disposed
[INFO] YaffiContainer has been disposed.
[DEBUG] Starting container...
[DEBUG] Loading the service container class org.apache.fulcrum.yaafi.framework.container.ServiceContainerImpl
[DEBUG] Instantiating the service container class org.apache.fulcrum.yaafi.framework.container.ServiceContainerImpl
[DEBUG] Using the following configuration : <?xml version="1.0" encoding="UTF-8"?><fulcrum-yaafi><containerFlavour>yaafi</containerFlavour><containerClazzName>org.apache.fulcrum.yaafi.framework.container.ServiceContainerImpl</containerClazzName><componentRoles><location>src/test/resources/TestRoleConfig.xml</location><isEncrypted>false</isEncrypted></componentRoles><componentConfiguration><location>src/test/resources/TestComponentConfig.xml</location><isEncrypted>false</isEncrypted></componentConfiguration><parameters><location/><isEncrypted>false</isEncrypted></parameters></fulcrum-yaafi>
[DEBUG] Using the following container type : yaafi
[DEBUG] YAAFI Service Framework is starting up
[DEBUG] Setting applicationRootDir to <https://builds.apache.org/job/Torque4-trunk/org.apache.torque$torque-runtime/ws/>
[DEBUG] Setting tempRootDir to /tmp
[DEBUG] Looking for src/test/resources/TestRoleConfig.xml in the root directory
[DEBUG] Found src/test/resources/TestRoleConfig.xml as <https://builds.apache.org/job/Torque4-trunk/org.apache.torque$torque-runtime/ws/src/test/resources/TestRoleConfig.xml>
[DEBUG] Looking for src/test/resources/TestComponentConfig.xml in the root directory
[DEBUG] Found src/test/resources/TestComponentConfig.xml as <https://builds.apache.org/job/Torque4-trunk/org.apache.torque$torque-runtime/ws/src/test/resources/TestComponentConfig.xml>
[DEBUG] Looking for /componentConfiguration.properties in the root directory
[DEBUG] Looking for /componentConfiguration.properties as absolute file location
[DEBUG] Looking for /componentConfiguration.properties using the class loader
[WARNING] Unable to find any resource with the name '/componentConfiguration.properties'
[DEBUG] Unable to load the following optional file :/componentConfiguration.properties
[DEBUG] Using the following componentConfigurationProperties: {java.runtime.name=Java(TM) SE Runtime Environment, urn:avalon:temp=/tmp, sun.boot.library.path=/usr/local/asfpackages/java/jdk1.8.0_152/jre/lib/amd64, java.vm.version=25.152-b16, urn:avalon:home=<https://builds.apache.org/job/Torque4-trunk/org.apache.torque$torque-runtime/ws/,> java.vm.vendor=Oracle Corporation, java.vendor.url=http://java.oracle.com/, path.separator=:, java.vm.name=Java HotSpot(TM) 64-Bit Server VM, file.encoding.pkg=sun.io, user.country=US, sun.java.launcher=SUN_STANDARD, sun.os.patch.level=unknown, urn:avalon:name=fulcrum-yaafi, java.vm.specification.name=Java Virtual Machine Specification, user.dir=<https://builds.apache.org/job/Torque4-trunk/org.apache.torque$torque-runtime/ws/,> urn:avalon:partition=root, java.runtime.version=1.8.0_152-b16, java.awt.graphicsenv=sun.awt.X11GraphicsEnvironment, basedir=<https://builds.apache.org/job/Torque4-trunk/org.apache.torque$torque-runtime/ws/,> java.endorsed.dirs=/usr/local/asfpackages/java/jdk1.8.0_152/jre/lib/endorsed, os.arch=amd64, surefire.real.class.path=<https://builds.apache.org/job/Torque4-trunk/org.apache.torque$torque-runtime/ws/target/surefire/surefirebooter3391103058440935569.jar,> java.io.tmpdir=/tmp, line.separator=
, java.vm.specification.vendor=Oracle Corporation, os.name=Linux, sun.jnu.encoding=ISO-8859-1, java.library.path=/usr/java/packages/lib/amd64:/usr/lib64:/lib64:/lib:/usr/lib, surefire.test.class.path=<https://builds.apache.org/job/Torque4-trunk/org.apache.torque$torque-runtime/ws/target/test-classes>:<https://builds.apache.org/job/Torque4-trunk/org.apache.torque$torque-runtime/ws/target/classes>:/home/jenkins/jenkins-slave/maven-repositories/0/commons-configuration/commons-configuration/1.10/commons-configuration-1.10.jar:/home/jenkins/jenkins-slave/maven-repositories/0/commons-beanutils/commons-beanutils/1.9.2/commons-beanutils-1.9.2.jar:/home/jenkins/jenkins-slave/maven-repositories/0/commons-collections/commons-collections/3.2.1/commons-collections-3.2.1.jar:/home/jenkins/jenkins-slave/maven-repositories/0/commons-dbcp/commons-dbcp/1.4/commons-dbcp-1.4.jar:/home/jenkins/jenkins-slave/maven-repositories/0/commons-pool/commons-pool/1.5.4/commons-pool-1.5.4.jar:/home/jenkins/jenkins-slave/maven-repositories/0/org/apache/commons/commons-dbcp2/2.1.1/commons-dbcp2-2.1.1.jar:/home/jenkins/jenkins-slave/maven-repositories/0/org/apache/commons/commons-pool2/2.4.2/commons-pool2-2.4.2.jar:/home/jenkins/jenkins-slave/maven-repositories/0/commons-lang/commons-lang/2.6/commons-lang-2.6.jar:/home/jenkins/jenkins-slave/maven-repositories/0/commons-logging/commons-logging/1.2/commons-logging-1.2.jar:/home/jenkins/jenkins-slave/maven-repositories/0/org/apache/commons/commons-jcs-core/2.0-beta-2/commons-jcs-core-2.0-beta-2.jar:/home/jenkins/jenkins-slave/maven-repositories/0/junit/junit/3.8.1/junit-3.8.1.jar:/home/jenkins/jenkins-slave/maven-repositories/0/org/apache/avalon/framework/avalon-framework-api/4.3.1/avalon-framework-api-4.3.1.jar:/home/jenkins/jenkins-slave/maven-repositories/0/org/apache/fulcrum/fulcrum-testcontainer/1.0.6/fulcrum-testcontainer-1.0.6.jar:/home/jenkins/jenkins-slave/maven-repositories/0/org/apache/fulcrum/fulcrum-yaafi/1.0.6/fulcrum-yaafi-1.0.6.jar:/home/jenkins/jenkins-slave/maven-repositories/0/org/apache/avalon/framework/avalon-framework-impl/4.3.1/avalon-framework-impl-4.3.1.jar:/home/jenkins/jenkins-slave/maven-repositories/0/org/mockito/mockito-all/1.9.0/mockito-all-1.9.0.jar:, java.specification.name=Java Platform API Specification, java.class.version=52.0, sun.management.compiler=HotSpot 64-Bit Tiered Compilers, maven.repo.local=/home/jenkins/jenkins-slave/maven-repositories/0, os.version=4.4.0-109-generic, user.home=/home/jenkins, user.timezone=, java.awt.printerjob=sun.print.PSPrinterJob, java.specification.version=1.8, file.encoding=ISO-8859-1, user.name=jenkins, java.class.path=<https://builds.apache.org/job/Torque4-trunk/org.apache.torque$torque-runtime/ws/target/test-classes>:<https://builds.apache.org/job/Torque4-trunk/org.apache.torque$torque-runtime/ws/target/classes>:/home/jenkins/jenkins-slave/maven-repositories/0/commons-configuration/commons-configuration/1.10/commons-configuration-1.10.jar:/home/jenkins/jenkins-slave/maven-repositories/0/commons-beanutils/commons-beanutils/1.9.2/commons-beanutils-1.9.2.jar:/home/jenkins/jenkins-slave/maven-repositories/0/commons-collections/commons-collections/3.2.1/commons-collections-3.2.1.jar:/home/jenkins/jenkins-slave/maven-repositories/0/commons-dbcp/commons-dbcp/1.4/commons-dbcp-1.4.jar:/home/jenkins/jenkins-slave/maven-repositories/0/commons-pool/commons-pool/1.5.4/commons-pool-1.5.4.jar:/home/jenkins/jenkins-slave/maven-repositories/0/org/apache/commons/commons-dbcp2/2.1.1/commons-dbcp2-2.1.1.jar:/home/jenkins/jenkins-slave/maven-repositories/0/org/apache/commons/commons-pool2/2.4.2/commons-pool2-2.4.2.jar:/home/jenkins/jenkins-slave/maven-repositories/0/commons-lang/commons-lang/2.6/commons-lang-2.6.jar:/home/jenkins/jenkins-slave/maven-repositories/0/commons-logging/commons-logging/1.2/commons-logging-1.2.jar:/home/jenkins/jenkins-slave/maven-repositories/0/org/apache/commons/commons-jcs-core/2.0-beta-2/commons-jcs-core-2.0-beta-2.jar:/home/jenkins/jenkins-slave/maven-repositories/0/junit/junit/3.8.1/junit-3.8.1.jar:/home/jenkins/jenkins-slave/maven-repositories/0/org/apache/avalon/framework/avalon-framework-api/4.3.1/avalon-framework-api-4.3.1.jar:/home/jenkins/jenkins-slave/maven-repositories/0/org/apache/fulcrum/fulcrum-testcontainer/1.0.6/fulcrum-testcontainer-1.0.6.jar:/home/jenkins/jenkins-slave/maven-repositories/0/org/apache/fulcrum/fulcrum-yaafi/1.0.6/fulcrum-yaafi-1.0.6.jar:/home/jenkins/jenkins-slave/maven-repositories/0/org/apache/avalon/framework/avalon-framework-impl/4.3.1/avalon-framework-impl-4.3.1.jar:/home/jenkins/jenkins-slave/maven-repositories/0/org/mockito/mockito-all/1.9.0/mockito-all-1.9.0.jar:, java.vm.specification.version=1.8, sun.arch.data.model=64, java.home=/usr/local/asfpackages/java/jdk1.8.0_152/jre, sun.java.command=<https://builds.apache.org/job/Torque4-trunk/org.apache.torque$torque-runtime/ws/target/surefire/surefirebooter3391103058440935569.jar> <https://builds.apache.org/job/Torque4-trunk/org.apache.torque$torque-runtime/ws/target/surefire/surefire2504229156742545951tmp> <https://builds.apache.org/job/Torque4-trunk/org.apache.torque$torque-runtime/ws/target/surefire/surefire_03663120834261123862tmp,> java.specification.vendor=Oracle Corporation, user.language=en, awt.toolkit=sun.awt.X11.XToolkit, java.vm.info=mixed mode, java.version=1.8.0_152, java.ext.dirs=/usr/local/asfpackages/java/jdk1.8.0_152/jre/lib/ext:/usr/java/packages/lib/ext, sun.boot.class.path=/usr/local/asfpackages/java/jdk1.8.0_152/jre/lib/resources.jar:/usr/local/asfpackages/java/jdk1.8.0_152/jre/lib/rt.jar:/usr/local/asfpackages/java/jdk1.8.0_152/jre/lib/sunrsasign.jar:/usr/local/asfpackages/java/jdk1.8.0_152/jre/lib/jsse.jar:/usr/local/asfpackages/java/jdk1.8.0_152/jre/lib/jce.jar:/usr/local/asfpackages/java/jdk1.8.0_152/jre/lib/charsets.jar:/usr/local/asfpackages/java/jdk1.8.0_152/jre/lib/jfr.jar:/usr/local/asfpackages/java/jdk1.8.0_152/jre/classes, java.vendor=Oracle Corporation, localRepository=/home/jenkins/jenkins-slave/maven-repositories/0, file.separator=/, derby.stream.error.file=target/derby.log, java.vendor.url.bug=http://bugreport.sun.com/bugreport/, sun.cpu.endian=little, sun.io.unicode.encoding=UnicodeLittle, sun.cpu.isalist=}
[DEBUG] Looking for /parameters.properties in the root directory
[DEBUG] Looking for /parameters.properties as absolute file location
[DEBUG] Looking for /parameters.properties using the class loader
[WARNING] Unable to find any resource with the name '/parameters.properties'
[DEBUG] Configuring the service component TorqueComponent
[DEBUG] Incarnating the service TorqueComponent
[DEBUG] Instantiating the implementation class for TorqueComponent
[DEBUG] Incarnating the service TorqueComponent
[DEBUG] LogEnabled.enableLogging() for TorqueComponent
[DEBUG] Contextualizable.contextualize() for TorqueComponent
[DEBUG] Configurable.configure() for TorqueComponent
[DEBUG] configure(TorqueComponent::<no value>:@null:20:22)
[DEBUG] Config File changes to src/test/resources/Torque.properties
[DEBUG] Config File is <https://builds.apache.org/job/Torque4-trunk/org.apache.torque$torque-runtime/ws/src/test/resources/Torque.properties>
[DEBUG] Initializable.initialize() for TorqueComponent
[DEBUG] initialize()
[DEBUG] YAAFI Avalon Service Container is up and running
[INFO] YaffiContainer ready.
[DEBUG] Located the service 'org.apache.torque.avalon.Torque' in the local container
[DEBUG] Disposing of container...
[DEBUG] Disposing all services
[DEBUG] Decommision the service TorqueComponent
[DEBUG] Decommisioning the service TorqueComponent
[DEBUG] Disposable.dispose() for TorqueComponent
[DEBUG] dispose()
[DEBUG] Disposing the service TorqueComponent
[DEBUG] All services are disposed
[INFO] YaffiContainer has been disposed.
Tests run: 2, Failures: 0, Errors: 0, Skipped: 0, Time elapsed: 0.227 sec - in org.apache.torque.avalon.AvalonTest
Running org.apache.torque.sql.SqlBuilderTest
Tests run: 130, Failures: 0, Errors: 0, Skipped: 0, Time elapsed: 0.39 sec - in org.apache.torque.sql.SqlBuilderTest
Running org.apache.torque.sql.QueryTest
Tests run: 2, Failures: 0, Errors: 0, Skipped: 0, Time elapsed: 0.16 sec - in org.apache.torque.sql.QueryTest
Running org.apache.torque.TorqueRuntimeExceptionTest
Tests run: 1, Failures: 0, Errors: 0, Skipped: 0, Time elapsed: 0.128 sec - in org.apache.torque.TorqueRuntimeExceptionTest
Running org.apache.torque.map.ColumnMapTest
Tests run: 3, Failures: 0, Errors: 0, Skipped: 0, Time elapsed: 0.153 sec - in org.apache.torque.map.ColumnMapTest
Running org.apache.torque.TorqueInstanceTest
Tests run: 5, Failures: 0, Errors: 0, Skipped: 0, Time elapsed: 0.151 sec - in org.apache.torque.TorqueInstanceTest
Running org.apache.torque.om.mapper.DateMapperTest
Tests run: 3, Failures: 0, Errors: 0, Skipped: 0, Time elapsed: 0.363 sec - in org.apache.torque.om.mapper.DateMapperTest
Running org.apache.torque.om.mapper.StringMapperTest
Tests run: 3, Failures: 0, Errors: 0, Skipped: 0, Time elapsed: 0.364 sec - in org.apache.torque.om.mapper.StringMapperTest
Running org.apache.torque.om.mapper.BigDecimalMapperTest
Tests run: 3, Failures: 0, Errors: 0, Skipped: 0, Time elapsed: 0.377 sec - in org.apache.torque.om.mapper.BigDecimalMapperTest
Running org.apache.torque.om.mapper.LongMapperTest
Tests run: 3, Failures: 0, Errors: 0, Skipped: 0, Time elapsed: 0.398 sec - in org.apache.torque.om.mapper.LongMapperTest
Running org.apache.torque.om.mapper.IntegerMapperTest
Tests run: 3, Failures: 0, Errors: 0, Skipped: 0, Time elapsed: 0.406 sec - in org.apache.torque.om.mapper.IntegerMapperTest
Running org.apache.torque.om.mapper.ObjectListMapperTest
Tests run: 12, Failures: 0, Errors: 0, Skipped: 0, Time elapsed: 0.534 sec - in org.apache.torque.om.mapper.ObjectListMapperTest
Running org.apache.torque.om.mapper.CompositeMapperTest
Tests run: 2, Failures: 0, Errors: 0, Skipped: 0, Time elapsed: 0.369 sec - in org.apache.torque.om.mapper.CompositeMapperTest
Running org.apache.torque.om.ComboKeyTest
Tests run: 9, Failures: 0, Errors: 0, Skipped: 0, Time elapsed: 0.025 sec - in org.apache.torque.om.ComboKeyTest
Running org.apache.torque.om.NumberKeyTest
Tests run: 23, Failures: 0, Errors: 0, Skipped: 0, Time elapsed: 0.024 sec - in org.apache.torque.om.NumberKeyTest
Running org.apache.torque.util.UniqueListTest
Tests run: 2, Failures: 0, Errors: 0, Skipped: 0, Time elapsed: 0.013 sec - in org.apache.torque.util.UniqueListTest
Running org.apache.torque.util.BasePeerImplTest
Tests run: 16, Failures: 0, Errors: 0, Skipped: 0, Time elapsed: 0.602 sec - in org.apache.torque.util.BasePeerImplTest
Running org.apache.torque.util.SummaryHelperTest
Tests run: 1, Failures: 0, Errors: 0, Skipped: 0, Time elapsed: 0.524 sec - in org.apache.torque.util.SummaryHelperTest
Running org.apache.torque.util.functions.MinTest
Tests run: 4, Failures: 0, Errors: 0, Skipped: 0, Time elapsed: 0.022 sec - in org.apache.torque.util.functions.MinTest
Running org.apache.torque.util.functions.AvgTest
Tests run: 4, Failures: 0, Errors: 0, Skipped: 0, Time elapsed: 0.02 sec - in org.apache.torque.util.functions.AvgTest
Running org.apache.torque.util.functions.MaxTest
Tests run: 4, Failures: 0, Errors: 0, Skipped: 0, Time elapsed: 0.021 sec - in org.apache.torque.util.functions.MaxTest
Running org.apache.torque.util.functions.CountTest
Tests run: 4, Failures: 0, Errors: 0, Skipped: 0, Time elapsed: 0.021 sec - in org.apache.torque.util.functions.CountTest
Running org.apache.torque.util.functions.SumTest
Tests run: 4, Failures: 0, Errors: 0, Skipped: 0, Time elapsed: 0.021 sec - in org.apache.torque.util.functions.SumTest
Running org.apache.torque.util.functions.AggregateFunctionTest
Tests run: 12, Failures: 0, Errors: 0, Skipped: 0, Time elapsed: 0.022 sec - in org.apache.torque.util.functions.AggregateFunctionTest
Running org.apache.torque.util.functions.AbstractFunctionTest
Tests run: 11, Failures: 0, Errors: 0, Skipped: 0, Time elapsed: 0.027 sec - in org.apache.torque.util.functions.AbstractFunctionTest
Running org.apache.torque.criteria.CriteriaTest
Tests run: 33, Failures: 0, Errors: 0, Skipped: 0, Time elapsed: 0.325 sec - in org.apache.torque.criteria.CriteriaTest
Running org.apache.torque.criteria.JoinTest
Tests run: 2, Failures: 0, Errors: 0, Skipped: 0, Time elapsed: 0.133 sec - in org.apache.torque.criteria.JoinTest
Running org.apache.torque.criteria.CriterionTest
Tests run: 10, Failures: 0, Errors: 0, Skipped: 0, Time elapsed: 0.158 sec - in org.apache.torque.criteria.CriterionTest
Running org.apache.torque.ColumnImplTest
Tests run: 41, Failures: 0, Errors: 0, Skipped: 0, Time elapsed: 0.197 sec - in org.apache.torque.ColumnImplTest
Running org.apache.torque.adapter.DBOracleTest
Tests run: 1, Failures: 0, Errors: 0, Skipped: 0, Time elapsed: 0.043 sec - in org.apache.torque.adapter.DBOracleTest
Running org.apache.torque.manager.TestManager
Tests run: 0, Failures: 0, Errors: 0, Skipped: 0, Time elapsed: 0 sec - in org.apache.torque.manager.TestManager
Running org.apache.torque.manager.MethodResultCacheTest
Apr 06, 2018 9:25:11 AM org.apache.commons.jcs.engine.control.CompositeCacheManager getInstance
INFO: Instance is null, creating with config [/cache.ccf]
Apr 06, 2018 9:25:11 AM org.apache.commons.jcs.engine.control.CompositeCacheManager configure
INFO: Creating cache manager from config file: /cache.ccf
Apr 06, 2018 9:25:11 AM org.apache.commons.jcs.utils.threadpool.ThreadPoolManager loadConfig
INFO: thread_pool.default PoolConfiguration = useBoundary = [false] boundarySize = [2000] maximumPoolSize = [150] minimumPoolSize = [4] keepAliveTime = [300000] whenBlockedPolicy = [RUN] startUpSize = [4]
Apr 06, 2018 9:25:11 AM org.apache.commons.jcs.engine.control.CompositeCacheManager doConfigure
INFO: Setting default auxiliaries to
Apr 06, 2018 9:25:11 AM org.apache.commons.jcs.engine.control.CompositeCacheManager doConfigure
INFO: setting defaultCompositeCacheAttributes to [ useLateral = true, useRemote = true, useDisk = true, maxObjs = 1000, maxSpoolPerRun = -1, diskUsagePattern = SWAP, spoolChunkSize = 2 ]
Apr 06, 2018 9:25:11 AM org.apache.commons.jcs.engine.control.CompositeCacheConfigurator parseElementAttributes
INFO: No special ElementAttribute class defined for key [jcs.default.elementattributes], using default class.
Apr 06, 2018 9:25:11 AM org.apache.commons.jcs.engine.control.CompositeCacheManager doConfigure
INFO: setting defaultElementAttributes to [ IS_LATERAL = true, IS_SPOOL = true, IS_REMOTE = true, IS_ETERNAL = true, MaxLifeSeconds = -1, IdleTime = -1, CreateTime = 1523006711245, LastAccessTime = 1523006711245, getTimeToLiveSeconds() = -1, createTime = 1523006711245 ]
Apr 06, 2018 9:25:11 AM org.apache.commons.jcs.engine.control.CompositeCacheConfigurator parseElementAttributes
INFO: No special ElementAttribute class defined for key [jcs.region.testCache1.elementattributes], using default class.
Apr 06, 2018 9:25:11 AM org.apache.commons.jcs.engine.memory.AbstractDoubleLinkedListMemoryCache initialize
INFO: initialized MemoryCache for testCache1
Apr 06, 2018 9:25:11 AM org.apache.commons.jcs.engine.control.CompositeCache <init>
INFO: Constructed cache with name [testCache1] and cache attributes [ useLateral = true, useRemote = true, useDisk = true, maxObjs = 1000, maxSpoolPerRun = -1, diskUsagePattern = SWAP, spoolChunkSize = 2 ]
Apr 06, 2018 9:25:11 AM org.apache.commons.jcs.engine.control.CompositeCacheConfigurator parseRegions
INFO: Parsed regions [testCache1]
Apr 06, 2018 9:25:11 AM org.apache.commons.jcs.engine.control.CompositeCacheManager doConfigure
INFO: Finished configuration in 30 ms.
Tests run: 3, Failures: 0, Errors: 0, Skipped: 0, Time elapsed: 0.284 sec - in org.apache.torque.manager.MethodResultCacheTest
Running org.apache.torque.manager.TestPersistent
Tests run: 0, Failures: 0, Errors: 0, Skipped: 0, Time elapsed: 0 sec - in org.apache.torque.manager.TestPersistent
Running org.apache.torque.manager.AbstractBaseManagerTest
Apr 06, 2018 9:25:12 AM org.apache.commons.jcs.engine.control.CompositeCacheManager getInstance
INFO: Instance is null, creating with config [/cache.ccf]
Apr 06, 2018 9:25:12 AM org.apache.commons.jcs.engine.control.CompositeCacheManager configure
INFO: Creating cache manager from config file: /cache.ccf
Apr 06, 2018 9:25:12 AM org.apache.commons.jcs.utils.threadpool.ThreadPoolManager loadConfig
INFO: thread_pool.default PoolConfiguration = useBoundary = [false] boundarySize = [2000] maximumPoolSize = [150] minimumPoolSize = [4] keepAliveTime = [300000] whenBlockedPolicy = [RUN] startUpSize = [4]
Apr 06, 2018 9:25:12 AM org.apache.commons.jcs.engine.control.CompositeCacheManager doConfigure
INFO: Setting default auxiliaries to
Apr 06, 2018 9:25:12 AM org.apache.commons.jcs.engine.control.CompositeCacheManager doConfigure
INFO: setting defaultCompositeCacheAttributes to [ useLateral = true, useRemote = true, useDisk = true, maxObjs = 1000, maxSpoolPerRun = -1, diskUsagePattern = SWAP, spoolChunkSize = 2 ]
Apr 06, 2018 9:25:12 AM org.apache.commons.jcs.engine.control.CompositeCacheConfigurator parseElementAttributes
INFO: No special ElementAttribute class defined for key [jcs.default.elementattributes], using default class.
Apr 06, 2018 9:25:12 AM org.apache.commons.jcs.engine.control.CompositeCacheManager doConfigure
INFO: setting defaultElementAttributes to [ IS_LATERAL = true, IS_SPOOL = true, IS_REMOTE = true, IS_ETERNAL = true, MaxLifeSeconds = -1, IdleTime = -1, CreateTime = 1523006712631, LastAccessTime = 1523006712631, getTimeToLiveSeconds() = -1, createTime = 1523006712631 ]
Apr 06, 2018 9:25:12 AM org.apache.commons.jcs.engine.control.CompositeCacheConfigurator parseElementAttributes
INFO: No special ElementAttribute class defined for key [jcs.region.testCache1.elementattributes], using default class.
Apr 06, 2018 9:25:12 AM org.apache.commons.jcs.engine.memory.AbstractDoubleLinkedListMemoryCache initialize
INFO: initialized MemoryCache for testCache1
Apr 06, 2018 9:25:12 AM org.apache.commons.jcs.engine.control.CompositeCache <init>
INFO: Constructed cache with name [testCache1] and cache attributes [ useLateral = true, useRemote = true, useDisk = true, maxObjs = 1000, maxSpoolPerRun = -1, diskUsagePattern = SWAP, spoolChunkSize = 2 ]
Apr 06, 2018 9:25:12 AM org.apache.commons.jcs.engine.control.CompositeCacheConfigurator parseRegions
INFO: Parsed regions [testCache1]
Apr 06, 2018 9:25:12 AM org.apache.commons.jcs.engine.control.CompositeCacheManager doConfigure
INFO: Finished configuration in 30 ms.
Tests run: 9, Failures: 0, Errors: 0, Skipped: 0, Time elapsed: 0.281 sec - in org.apache.torque.manager.AbstractBaseManagerTest
Apr 06, 2018 9:25:12 AM org.apache.commons.jcs.engine.control.CompositeCacheManager run
INFO: Shutdown hook activated.  Shutdown was not called.  Shutting down JCS.

Results :

Tests run: 365, Failures: 0, Errors: 0, Skipped: 0

[JENKINS] Recording test results
[INFO]
[INFO] --- maven-jar-plugin:3.0.0:jar (default-jar) @ torque-runtime ---
[INFO] Building jar: <https://builds.apache.org/job/Torque4-trunk/org.apache.torque$torque-runtime/ws/target/torque-runtime-4.1-SNAPSHOT.jar>
[INFO]
[INFO] --- maven-site-plugin:3.5.1:attach-descriptor (attach-descriptor) @ torque-runtime ---
[INFO]
[INFO] --- maven-source-plugin:3.0.0:jar-no-fork (attach-sources) @ torque-runtime ---
[INFO] Building jar: <https://builds.apache.org/job/Torque4-trunk/org.apache.torque$torque-runtime/ws/target/torque-runtime-4.1-SNAPSHOT-sources.jar>
[INFO]
[INFO] --- apache-rat-plugin:0.11:check (default) @ torque-runtime ---
[INFO] 51 implicit excludes (use -debug for more details).
[INFO] Exclude: velocity.log
[INFO] Exclude: .checkstyle
[INFO] Exclude: checkstyle-cache.ccf
[INFO] Exclude: derby.log
[INFO] Exclude: LICENSE-EDL.txt
[INFO] Exclude: DEPENDENCIES
[INFO] Exclude: torque-test/target/**/*
[INFO] Exclude: torque-test/.classpath
[INFO] Exclude: torque-test/.project
[INFO] Exclude: torque-test/.settings/**
[INFO] Exclude: torque-test/src/main/generated-java/**/*
[INFO] Exclude: torque-test/derby.log
[INFO] 182 resources included (use -debug for more details)
[INFO] Rat check: Summary of files. Unapproved: 0 unknown: 0 generated: 0 approved: 180 licence.
[CHECKSTYLE] No report found for mojo check
[PMD] No report found for mojo check[INFO]

[INFO] --- maven-install-plugin:2.5.2:install (default-install) @ torque-runtime ---
[INFO] Installing <https://builds.apache.org/job/Torque4-trunk/org.apache.torque$torque-runtime/ws/target/torque-runtime-4.1-SNAPSHOT.jar> to /home/jenkins/jenkins-slave/maven-repositories/0/org/apache/torque/torque-runtime/4.1-SNAPSHOT/torque-runtime-4.1-SNAPSHOT.jar
[INFO] Installing <https://builds.apache.org/job/Torque4-trunk/org.apache.torque$torque-runtime/ws/pom.xml> to /home/jenkins/jenkins-slave/maven-repositories/0/org/apache/torque/torque-runtime/4.1-SNAPSHOT/torque-runtime-4.1-SNAPSHOT.pom
[INFO] Installing <https://builds.apache.org/job/Torque4-trunk/org.apache.torque$torque-runtime/ws/target/torque-runtime-4.1-SNAPSHOT-sources.jar> to /home/jenkins/jenkins-slave/maven-repositories/0/org/apache/torque/torque-runtime/4.1-SNAPSHOT/torque-runtime-4.1-SNAPSHOT-sources.jar
[INFO]
[INFO] >>> cobertura-maven-plugin:2.3:cobertura (default-cli) > [cobertura]test @ torque-runtime >>>
[INFO]
[INFO] --- maven-remote-resources-plugin:1.5:process (process-resource-bundles) @ torque-runtime ---
[INFO]
[INFO] --- maven-resources-plugin:2.7:resources (default-resources) @ torque-runtime ---
[INFO] Using 'ISO-8859-1' encoding to copy filtered resources.
[INFO] skip non existing resourceDirectory <https://builds.apache.org/job/Torque4-trunk/org.apache.torque$torque-runtime/ws/src/main/resources>
[INFO] Copying 3 resources
[INFO] Copying 3 resources
[INFO]
[INFO] --- maven-compiler-plugin:3.5.1:compile (default-compile) @ torque-runtime ---
[INFO] Nothing to compile - all classes are up to date
[INFO]
[INFO] --- cobertura-maven-plugin:2.3:instrument (default-cli) @ torque-runtime ---
[INFO] Cobertura 1.9.2 - GNU GPL License (NO WARRANTY) - See COPYRIGHT file
Instrumenting 122 files to <https://builds.apache.org/job/Torque4-trunk/org.apache.torque$torque-runtime/ws/target/generated-classes/cobertura>
Cobertura: Saved information on 122 classes.
Instrument time: 519ms

[INFO] Instrumentation was successful.
[INFO]
[INFO] --- maven-resources-plugin:2.7:testResources (default-testResources) @ torque-runtime ---
[INFO] Using 'ISO-8859-1' encoding to copy filtered resources.
[INFO] Copying 5 resources
[INFO] Copying 3 resources
[INFO] Copying 3 resources
[INFO]
[INFO] --- maven-compiler-plugin:3.5.1:testCompile (default-testCompile) @ torque-runtime ---
[INFO] Nothing to compile - all classes are up to date
[INFO]
[INFO] --- maven-surefire-plugin:2.19.1:test (default-test) @ torque-runtime ---

-------------------------------------------------------
 T E S T S
-------------------------------------------------------

Results :

Tests run: 0, Failures: 0, Errors: 0, Skipped: 0

[JENKINS] Recording test results

---------------------------------------------------------------------
To unsubscribe, e-mail: [hidden email]
For additional commands, e-mail: [hidden email]

Reply | Threaded
Open this post in threaded view
|

Build failed in Jenkins: Torque4-trunk » Torque Runtime #577

Apache Jenkins Server-2
See <https://builds.apache.org/job/Torque4-trunk/org.apache.torque$torque-runtime/577/display/redirect?page=changes>

Changes:

[tv] Use ConcurrentMap

[tv] - Introduce dependency management to keep dependency versions consistent
- Update dependencies commons-collections, commons-dbcp2, commons-jcs-core etc

------------------------------------------
[INFO]
[INFO] ------------------------------------------------------------------------
[INFO] Building Torque Runtime 4.1-SNAPSHOT
[INFO] ------------------------------------------------------------------------
[INFO] Downloading from central: https://repo.maven.apache.org/maven2/org/apache/commons/commons-jcs-core/2.2/commons-jcs-core-2.2.pom
[INFO] Downloaded from central: https://repo.maven.apache.org/maven2/org/apache/commons/commons-jcs-core/2.2/commons-jcs-core-2.2.pom (6.1 kB at 246 kB/s)
[INFO] Downloading from central: https://repo.maven.apache.org/maven2/org/apache/commons/commons-jcs/2.2/commons-jcs-2.2.pom
[INFO] Downloaded from central: https://repo.maven.apache.org/maven2/org/apache/commons/commons-jcs/2.2/commons-jcs-2.2.pom (19 kB at 975 kB/s)
[INFO] Downloading from central: https://repo.maven.apache.org/maven2/org/apache/commons/commons-jcs-core/2.2/commons-jcs-core-2.2.jar
[INFO] Downloaded from central: https://repo.maven.apache.org/maven2/org/apache/commons/commons-jcs-core/2.2/commons-jcs-core-2.2.jar (535 kB at 11 MB/s)
[INFO]
[INFO] --- maven-clean-plugin:3.0.0:clean (default-clean) @ torque-runtime ---
[INFO]
[INFO] --- maven-remote-resources-plugin:1.5:process (process-resource-bundles) @ torque-runtime ---
[INFO]
[INFO] --- maven-resources-plugin:2.7:resources (default-resources) @ torque-runtime ---
[INFO] Using 'ISO-8859-1' encoding to copy filtered resources.
[INFO] skip non existing resourceDirectory <https://builds.apache.org/job/Torque4-trunk/org.apache.torque$torque-runtime/ws/src/main/resources>
[INFO] Copying 3 resources
[INFO]
[INFO] --- maven-compiler-plugin:3.5.1:compile (default-compile) @ torque-runtime ---
[INFO] Changes detected - recompiling the module!
[INFO] Compiling 119 source files to <https://builds.apache.org/job/Torque4-trunk/org.apache.torque$torque-runtime/ws/target/classes>
[INFO]
[INFO] --- maven-resources-plugin:2.7:testResources (default-testResources) @ torque-runtime ---
[INFO] Using 'ISO-8859-1' encoding to copy filtered resources.
[INFO] Copying 5 resources
[INFO] Copying 3 resources
[INFO]
[INFO] --- maven-compiler-plugin:3.5.1:testCompile (default-testCompile) @ torque-runtime ---
[INFO] Changes detected - recompiling the module!
[INFO] Compiling 35 source files to <https://builds.apache.org/job/Torque4-trunk/org.apache.torque$torque-runtime/ws/target/test-classes>
[INFO]
[INFO] --- maven-surefire-plugin:2.19.1:test (default-test) @ torque-runtime ---
[WARNING] The parameter forkMode is deprecated since version 2.14. Use forkCount and reuseForks instead.

-------------------------------------------------------
 T E S T S
-------------------------------------------------------
Running org.apache.torque.om.ComboKeyTest
Tests run: 9, Failures: 0, Errors: 0, Skipped: 0, Time elapsed: 0.03 sec - in org.apache.torque.om.ComboKeyTest
Running org.apache.torque.om.mapper.LongMapperTest
Tests run: 3, Failures: 0, Errors: 0, Skipped: 0, Time elapsed: 0.377 sec - in org.apache.torque.om.mapper.LongMapperTest
Running org.apache.torque.om.mapper.StringMapperTest
Tests run: 3, Failures: 0, Errors: 0, Skipped: 0, Time elapsed: 0.353 sec - in org.apache.torque.om.mapper.StringMapperTest
Running org.apache.torque.om.mapper.BigDecimalMapperTest
Tests run: 3, Failures: 0, Errors: 0, Skipped: 0, Time elapsed: 0.381 sec - in org.apache.torque.om.mapper.BigDecimalMapperTest
Running org.apache.torque.om.mapper.ObjectListMapperTest
Tests run: 12, Failures: 0, Errors: 0, Skipped: 0, Time elapsed: 0.475 sec - in org.apache.torque.om.mapper.ObjectListMapperTest
Running org.apache.torque.om.mapper.IntegerMapperTest
Tests run: 3, Failures: 0, Errors: 0, Skipped: 0, Time elapsed: 0.356 sec - in org.apache.torque.om.mapper.IntegerMapperTest
Running org.apache.torque.om.mapper.CompositeMapperTest
Tests run: 2, Failures: 0, Errors: 0, Skipped: 0, Time elapsed: 0.359 sec - in org.apache.torque.om.mapper.CompositeMapperTest
Running org.apache.torque.om.mapper.DateMapperTest
Tests run: 3, Failures: 0, Errors: 0, Skipped: 0, Time elapsed: 0.37 sec - in org.apache.torque.om.mapper.DateMapperTest
Running org.apache.torque.om.NumberKeyTest
Tests run: 23, Failures: 0, Errors: 0, Skipped: 0, Time elapsed: 0.044 sec - in org.apache.torque.om.NumberKeyTest
Running org.apache.torque.adapter.DBOracleTest
Tests run: 1, Failures: 0, Errors: 0, Skipped: 0, Time elapsed: 0.053 sec - in org.apache.torque.adapter.DBOracleTest
Running org.apache.torque.criteria.CriterionTest
Tests run: 10, Failures: 0, Errors: 0, Skipped: 0, Time elapsed: 0.183 sec - in org.apache.torque.criteria.CriterionTest
Running org.apache.torque.criteria.CriteriaTest
Tests run: 33, Failures: 0, Errors: 0, Skipped: 0, Time elapsed: 0.585 sec - in org.apache.torque.criteria.CriteriaTest
Running org.apache.torque.criteria.JoinTest
Tests run: 2, Failures: 0, Errors: 0, Skipped: 0, Time elapsed: 0.14 sec - in org.apache.torque.criteria.JoinTest
Running org.apache.torque.avalon.AvalonTest
[WARNING] Unable to find any resource with the name '/componentConfiguration.properties'
[WARNING] Unable to find any resource with the name '/parameters.properties'
[INFO] YaffiContainer ready.
[INFO] YaffiContainer has been disposed.
[WARNING] Unable to find any resource with the name '/componentConfiguration.properties'
[WARNING] Unable to find any resource with the name '/parameters.properties'
[INFO] YaffiContainer ready.
[INFO] YaffiContainer has been disposed.
Tests run: 2, Failures: 0, Errors: 0, Skipped: 0, Time elapsed: 0.253 sec - in org.apache.torque.avalon.AvalonTest
Running org.apache.torque.TorqueRuntimeExceptionTest
Tests run: 1, Failures: 0, Errors: 0, Skipped: 0, Time elapsed: 0.126 sec - in org.apache.torque.TorqueRuntimeExceptionTest
Running org.apache.torque.manager.MethodResultCacheTest
Apr 06, 2018 1:25:44 PM org.apache.commons.jcs.engine.control.CompositeCacheManager getInstance
INFO: Instance is null, creating with config [/cache.ccf]
Apr 06, 2018 1:25:44 PM org.apache.commons.jcs.engine.control.CompositeCacheManager configure
INFO: Creating cache manager from config file: /cache.ccf
Apr 06, 2018 1:25:44 PM org.apache.commons.jcs.utils.threadpool.ThreadPoolManager loadConfig
INFO: thread_pool.default PoolConfiguration = useBoundary = [false] boundarySize = [2000] maximumPoolSize = [150] minimumPoolSize = [4] keepAliveTime = [300000] whenBlockedPolicy = [RUN] startUpSize = [4]
Apr 06, 2018 1:25:44 PM org.apache.commons.jcs.engine.control.CompositeCacheManager doConfigure
INFO: Setting default auxiliaries to
Apr 06, 2018 1:25:44 PM org.apache.commons.jcs.engine.control.CompositeCacheManager doConfigure
INFO: setting defaultCompositeCacheAttributes to [ useLateral = true, useRemote = true, useDisk = true, maxObjs = 1000, maxSpoolPerRun = -1, diskUsagePattern = SWAP, spoolChunkSize = 2 ]
Apr 06, 2018 1:25:44 PM org.apache.commons.jcs.engine.control.CompositeCacheConfigurator parseElementAttributes
INFO: No special ElementAttribute class defined for key [jcs.default.elementattributes], using default class.
Apr 06, 2018 1:25:44 PM org.apache.commons.jcs.engine.control.CompositeCacheManager doConfigure
INFO: setting defaultElementAttributes to [ IS_LATERAL = true, IS_SPOOL = true, IS_REMOTE = true, IS_ETERNAL = true, MaxLifeSeconds = -1, IdleTime = -1, CreateTime = 1523021144776, LastAccessTime = 1523021144776, getTimeToLiveSeconds() = -1, createTime = 1523021144776 ]
Apr 06, 2018 1:25:44 PM org.apache.commons.jcs.engine.control.CompositeCacheConfigurator parseElementAttributes
INFO: No special ElementAttribute class defined for key [jcs.region.testCache1.elementattributes], using default class.
Apr 06, 2018 1:25:44 PM org.apache.commons.jcs.engine.memory.AbstractDoubleLinkedListMemoryCache initialize
INFO: initialized MemoryCache for testCache1
Apr 06, 2018 1:25:44 PM org.apache.commons.jcs.engine.control.CompositeCache <init>
INFO: Constructed cache with name [testCache1] and cache attributes [ useLateral = true, useRemote = true, useDisk = true, maxObjs = 1000, maxSpoolPerRun = -1, diskUsagePattern = SWAP, spoolChunkSize = 2 ]
Apr 06, 2018 1:25:44 PM org.apache.commons.jcs.engine.control.CompositeCacheConfigurator parseRegions
INFO: Parsed regions [testCache1]
Apr 06, 2018 1:25:44 PM org.apache.commons.jcs.engine.control.CompositeCacheManager doConfigure
INFO: Finished configuration in 28 ms.
Tests run: 3, Failures: 0, Errors: 0, Skipped: 0, Time elapsed: 0.381 sec - in org.apache.torque.manager.MethodResultCacheTest
Running org.apache.torque.manager.AbstractBaseManagerTest
Apr 06, 2018 1:25:45 PM org.apache.commons.jcs.engine.control.CompositeCacheManager getInstance
INFO: Instance is null, creating with config [/cache.ccf]
Apr 06, 2018 1:25:45 PM org.apache.commons.jcs.engine.control.CompositeCacheManager configure
INFO: Creating cache manager from config file: /cache.ccf
Apr 06, 2018 1:25:45 PM org.apache.commons.jcs.utils.threadpool.ThreadPoolManager loadConfig
INFO: thread_pool.default PoolConfiguration = useBoundary = [false] boundarySize = [2000] maximumPoolSize = [150] minimumPoolSize = [4] keepAliveTime = [300000] whenBlockedPolicy = [RUN] startUpSize = [4]
Apr 06, 2018 1:25:45 PM org.apache.commons.jcs.engine.control.CompositeCacheManager doConfigure
INFO: Setting default auxiliaries to
Apr 06, 2018 1:25:45 PM org.apache.commons.jcs.engine.control.CompositeCacheManager doConfigure
INFO: setting defaultCompositeCacheAttributes to [ useLateral = true, useRemote = true, useDisk = true, maxObjs = 1000, maxSpoolPerRun = -1, diskUsagePattern = SWAP, spoolChunkSize = 2 ]
Apr 06, 2018 1:25:45 PM org.apache.commons.jcs.engine.control.CompositeCacheConfigurator parseElementAttributes
INFO: No special ElementAttribute class defined for key [jcs.default.elementattributes], using default class.
Apr 06, 2018 1:25:45 PM org.apache.commons.jcs.engine.control.CompositeCacheManager doConfigure
INFO: setting defaultElementAttributes to [ IS_LATERAL = true, IS_SPOOL = true, IS_REMOTE = true, IS_ETERNAL = true, MaxLifeSeconds = -1, IdleTime = -1, CreateTime = 1523021145615, LastAccessTime = 1523021145615, getTimeToLiveSeconds() = -1, createTime = 1523021145615 ]
Apr 06, 2018 1:25:45 PM org.apache.commons.jcs.engine.control.CompositeCacheConfigurator parseElementAttributes
INFO: No special ElementAttribute class defined for key [jcs.region.testCache1.elementattributes], using default class.
Apr 06, 2018 1:25:45 PM org.apache.commons.jcs.engine.memory.AbstractDoubleLinkedListMemoryCache initialize
INFO: initialized MemoryCache for testCache1
Apr 06, 2018 1:25:45 PM org.apache.commons.jcs.engine.control.CompositeCache <init>
INFO: Constructed cache with name [testCache1] and cache attributes [ useLateral = true, useRemote = true, useDisk = true, maxObjs = 1000, maxSpoolPerRun = -1, diskUsagePattern = SWAP, spoolChunkSize = 2 ]
Apr 06, 2018 1:25:45 PM org.apache.commons.jcs.engine.control.CompositeCacheConfigurator parseRegions
INFO: Parsed regions [testCache1]
Apr 06, 2018 1:25:45 PM org.apache.commons.jcs.engine.control.CompositeCacheManager doConfigure
INFO: Finished configuration in 30 ms.
Tests run: 9, Failures: 0, Errors: 0, Skipped: 0, Time elapsed: 0.296 sec - in org.apache.torque.manager.AbstractBaseManagerTest
Apr 06, 2018 1:25:45 PM org.apache.commons.jcs.engine.control.CompositeCacheManager run
INFO: Shutdown hook activated.  Shutdown was not called.  Shutting down JCS.
Running org.apache.torque.ColumnImplTest
Tests run: 41, Failures: 0, Errors: 0, Skipped: 0, Time elapsed: 0.214 sec - in org.apache.torque.ColumnImplTest
Running org.apache.torque.TorqueInstanceTest
Tests run: 5, Failures: 0, Errors: 0, Skipped: 0, Time elapsed: 0.143 sec - in org.apache.torque.TorqueInstanceTest
Running org.apache.torque.sql.SqlBuilderTest
Tests run: 130, Failures: 0, Errors: 0, Skipped: 0, Time elapsed: 0.617 sec - in org.apache.torque.sql.SqlBuilderTest
Running org.apache.torque.sql.QueryTest
Tests run: 2, Failures: 0, Errors: 0, Skipped: 0, Time elapsed: 0.131 sec - in org.apache.torque.sql.QueryTest
Running org.apache.torque.map.ColumnMapTest
Tests run: 3, Failures: 0, Errors: 0, Skipped: 0, Time elapsed: 0.129 sec - in org.apache.torque.map.ColumnMapTest
Running org.apache.torque.util.UniqueListTest
Tests run: 2, Failures: 0, Errors: 0, Skipped: 0, Time elapsed: 0.024 sec - in org.apache.torque.util.UniqueListTest
Running org.apache.torque.util.BasePeerImplTest
Tests run: 16, Failures: 0, Errors: 0, Skipped: 0, Time elapsed: 0.484 sec - in org.apache.torque.util.BasePeerImplTest
Running org.apache.torque.util.functions.SumTest
Tests run: 4, Failures: 0, Errors: 0, Skipped: 0, Time elapsed: 0.042 sec - in org.apache.torque.util.functions.SumTest
Running org.apache.torque.util.functions.MinTest
Tests run: 4, Failures: 0, Errors: 0, Skipped: 0, Time elapsed: 0.034 sec - in org.apache.torque.util.functions.MinTest
Running org.apache.torque.util.functions.CountTest
Tests run: 4, Failures: 0, Errors: 0, Skipped: 0, Time elapsed: 0.033 sec - in org.apache.torque.util.functions.CountTest
Running org.apache.torque.util.functions.AggregateFunctionTest
Tests run: 12, Failures: 0, Errors: 0, Skipped: 0, Time elapsed: 0.041 sec - in org.apache.torque.util.functions.AggregateFunctionTest
Running org.apache.torque.util.functions.MaxTest
Tests run: 4, Failures: 0, Errors: 0, Skipped: 0, Time elapsed: 0.032 sec - in org.apache.torque.util.functions.MaxTest
Running org.apache.torque.util.functions.AvgTest
Tests run: 4, Failures: 0, Errors: 0, Skipped: 0, Time elapsed: 0.036 sec - in org.apache.torque.util.functions.AvgTest
Running org.apache.torque.util.functions.AbstractFunctionTest
Tests run: 11, Failures: 0, Errors: 0, Skipped: 0, Time elapsed: 0.041 sec - in org.apache.torque.util.functions.AbstractFunctionTest
Running org.apache.torque.util.SummaryHelperTest
Tests run: 1, Failures: 0, Errors: 0, Skipped: 0, Time elapsed: 0.425 sec - in org.apache.torque.util.SummaryHelperTest

Results :

Tests run: 365, Failures: 0, Errors: 0, Skipped: 0

[JENKINS] Recording test results
[INFO]
[INFO] --- maven-jar-plugin:3.0.0:jar (default-jar) @ torque-runtime ---
[INFO] Building jar: <https://builds.apache.org/job/Torque4-trunk/org.apache.torque$torque-runtime/ws/target/torque-runtime-4.1-SNAPSHOT.jar>
[INFO]
[INFO] --- maven-site-plugin:3.5.1:attach-descriptor (attach-descriptor) @ torque-runtime ---
[INFO]
[INFO] --- maven-source-plugin:3.0.0:jar-no-fork (attach-sources) @ torque-runtime ---
[INFO] Building jar: <https://builds.apache.org/job/Torque4-trunk/org.apache.torque$torque-runtime/ws/target/torque-runtime-4.1-SNAPSHOT-sources.jar>
[INFO]
[INFO] --- apache-rat-plugin:0.11:check (default) @ torque-runtime ---
[INFO] 51 implicit excludes (use -debug for more details).
[INFO] Exclude: velocity.log
[INFO] Exclude: .checkstyle
[INFO] Exclude: checkstyle-cache.ccf
[INFO] Exclude: derby.log
[INFO] Exclude: LICENSE-EDL.txt
[INFO] Exclude: DEPENDENCIES
[INFO] Exclude: torque-test/target/**/*
[INFO] Exclude: torque-test/.classpath
[INFO] Exclude: torque-test/.project
[INFO] Exclude: torque-test/.settings/**
[INFO] Exclude: torque-test/src/main/generated-java/**/*
[INFO] Exclude: torque-test/derby.log
[INFO] 182 resources included (use -debug for more details)
[INFO] Rat check: Summary of files. Unapproved: 0 unknown: 0 generated: 0 approved: 180 licence.
[CHECKSTYLE] No report found for mojo check
[PMD] No report found for mojo check
[INFO]
[INFO] --- maven-install-plugin:2.5.2:install (default-install) @ torque-runtime ---
[INFO] Installing <https://builds.apache.org/job/Torque4-trunk/org.apache.torque$torque-runtime/ws/target/torque-runtime-4.1-SNAPSHOT.jar> to /home/jenkins/jenkins-slave/maven-repositories/1/org/apache/torque/torque-runtime/4.1-SNAPSHOT/torque-runtime-4.1-SNAPSHOT.jar
[INFO] Installing <https://builds.apache.org/job/Torque4-trunk/org.apache.torque$torque-runtime/ws/pom.xml> to /home/jenkins/jenkins-slave/maven-repositories/1/org/apache/torque/torque-runtime/4.1-SNAPSHOT/torque-runtime-4.1-SNAPSHOT.pom
[INFO] Installing <https://builds.apache.org/job/Torque4-trunk/org.apache.torque$torque-runtime/ws/target/torque-runtime-4.1-SNAPSHOT-sources.jar> to /home/jenkins/jenkins-slave/maven-repositories/1/org/apache/torque/torque-runtime/4.1-SNAPSHOT/torque-runtime-4.1-SNAPSHOT-sources.jar
[INFO]
[INFO] >>> cobertura-maven-plugin:2.3:cobertura (default-cli) > [cobertura]test @ torque-runtime >>>
[INFO]
[INFO] --- maven-remote-resources-plugin:1.5:process (process-resource-bundles) @ torque-runtime ---
[INFO]
[INFO] --- maven-resources-plugin:2.7:resources (default-resources) @ torque-runtime ---
[INFO] Using 'ISO-8859-1' encoding to copy filtered resources.
[INFO] skip non existing resourceDirectory <https://builds.apache.org/job/Torque4-trunk/org.apache.torque$torque-runtime/ws/src/main/resources>
[INFO] Copying 3 resources
[INFO] Copying 3 resources
[INFO]
[INFO] --- maven-compiler-plugin:3.5.1:compile (default-compile) @ torque-runtime ---
[INFO] Nothing to compile - all classes are up to date
[INFO]
[INFO] --- cobertura-maven-plugin:2.3:instrument (default-cli) @ torque-runtime ---
[INFO] Cobertura 1.9.2 - GNU GPL License (NO WARRANTY) - See COPYRIGHT file
Instrumenting 122 files to <https://builds.apache.org/job/Torque4-trunk/org.apache.torque$torque-runtime/ws/target/generated-classes/cobertura>
Cobertura: Saved information on 122 classes.
Instrument time: 462ms

[INFO] Instrumentation was successful.
[INFO]
[INFO] --- maven-resources-plugin:2.7:testResources (default-testResources) @ torque-runtime ---
[INFO] Using 'ISO-8859-1' encoding to copy filtered resources.
[INFO] Copying 5 resources
[INFO] Copying 3 resources
[INFO] Copying 3 resources
[INFO]
[INFO] --- maven-compiler-plugin:3.5.1:testCompile (default-testCompile) @ torque-runtime ---
[INFO] Nothing to compile - all classes are up to date
[INFO]
[INFO] --- maven-surefire-plugin:2.19.1:test (default-test) @ torque-runtime ---

-------------------------------------------------------
 T E S T S
-------------------------------------------------------

Results :

Tests run: 0, Failures: 0, Errors: 0, Skipped: 0

[JENKINS] Recording test results

---------------------------------------------------------------------
To unsubscribe, e-mail: [hidden email]
For additional commands, e-mail: [hidden email]

Reply | Threaded
Open this post in threaded view
|

Build failed in Jenkins: Torque4-trunk » Torque Runtime #578

Apache Jenkins Server-2
See <https://builds.apache.org/job/Torque4-trunk/org.apache.torque$torque-runtime/578/display/redirect>

------------------------------------------
[...truncated 625 B...]
[INFO] Downloading from central: https://repo.maven.apache.org/maven2/org/apache/fulcrum/fulcrum-testcontainer/1.0.7/fulcrum-testcontainer-1.0.7.pom
[INFO] Downloaded from central: https://repo.maven.apache.org/maven2/org/apache/fulcrum/fulcrum-testcontainer/1.0.7/fulcrum-testcontainer-1.0.7.pom (4.4 kB at 27 kB/s)
[INFO] Downloading from central: https://repo.maven.apache.org/maven2/org/apache/turbine/turbine-parent/3/turbine-parent-3.pom
[INFO] Downloaded from central: https://repo.maven.apache.org/maven2/org/apache/turbine/turbine-parent/3/turbine-parent-3.pom (20 kB at 118 kB/s)
[INFO] Downloading from central: https://repo.maven.apache.org/maven2/org/apache/fulcrum/fulcrum-yaafi/1.0.6/fulcrum-yaafi-1.0.6.pom
[INFO] Downloaded from central: https://repo.maven.apache.org/maven2/org/apache/fulcrum/fulcrum-yaafi/1.0.6/fulcrum-yaafi-1.0.6.pom (3.1 kB at 19 kB/s)
[INFO] Downloading from central: https://repo.maven.apache.org/maven2/org/apache/fulcrum/fulcrum-parent/1/fulcrum-parent-1.pom
[INFO] Downloaded from central: https://repo.maven.apache.org/maven2/org/apache/fulcrum/fulcrum-parent/1/fulcrum-parent-1.pom (19 kB at 114 kB/s)
[INFO] Downloading from central: https://repo.maven.apache.org/maven2/org/mockito/mockito-all/1.9.0/mockito-all-1.9.0.pom
[INFO] Downloaded from central: https://repo.maven.apache.org/maven2/org/mockito/mockito-all/1.9.0/mockito-all-1.9.0.pom (1.0 kB at 67 kB/s)
[INFO] Downloading from central: https://repo.maven.apache.org/maven2/org/apache/commons/commons-jcs-core/2.2/commons-jcs-core-2.2.jar
[INFO] Downloading from central: https://repo.maven.apache.org/maven2/org/apache/fulcrum/fulcrum-yaafi/1.0.6/fulcrum-yaafi-1.0.6.jar
[INFO] Downloading from central: https://repo.maven.apache.org/maven2/org/apache/fulcrum/fulcrum-testcontainer/1.0.7/fulcrum-testcontainer-1.0.7.jar
[INFO] Downloading from central: https://repo.maven.apache.org/maven2/org/mockito/mockito-all/1.9.0/mockito-all-1.9.0.jar
[INFO] Downloaded from central: https://repo.maven.apache.org/maven2/org/apache/commons/commons-jcs-core/2.2/commons-jcs-core-2.2.jar (535 kB at 8.1 MB/s)
[INFO] Downloaded from central: https://repo.maven.apache.org/maven2/org/mockito/mockito-all/1.9.0/mockito-all-1.9.0.jar (1.5 MB at 12 MB/s)
[INFO] Downloaded from central: https://repo.maven.apache.org/maven2/org/apache/fulcrum/fulcrum-testcontainer/1.0.7/fulcrum-testcontainer-1.0.7.jar (16 kB at 96 kB/s)
[INFO] Downloaded from central: https://repo.maven.apache.org/maven2/org/apache/fulcrum/fulcrum-yaafi/1.0.6/fulcrum-yaafi-1.0.6.jar (130 kB at 708 kB/s)
[INFO]
[INFO] --- maven-clean-plugin:3.0.0:clean (default-clean) @ torque-runtime ---
[INFO]
[INFO] --- maven-remote-resources-plugin:1.5:process (process-resource-bundles) @ torque-runtime ---
[INFO]
[INFO] --- maven-resources-plugin:2.7:resources (default-resources) @ torque-runtime ---
[INFO] Using 'ISO-8859-1' encoding to copy filtered resources.
[INFO] skip non existing resourceDirectory <https://builds.apache.org/job/Torque4-trunk/org.apache.torque$torque-runtime/ws/src/main/resources>
[INFO] Copying 3 resources
[INFO]
[INFO] --- maven-compiler-plugin:3.5.1:compile (default-compile) @ torque-runtime ---
[INFO] Changes detected - recompiling the module!
[INFO] Compiling 119 source files to <https://builds.apache.org/job/Torque4-trunk/org.apache.torque$torque-runtime/ws/target/classes>
[INFO]
[INFO] --- maven-resources-plugin:2.7:testResources (default-testResources) @ torque-runtime ---
[INFO] Using 'ISO-8859-1' encoding to copy filtered resources.
[INFO] Copying 5 resources
[INFO] Copying 3 resources
[INFO]
[INFO] --- maven-compiler-plugin:3.5.1:testCompile (default-testCompile) @ torque-runtime ---
[INFO] Changes detected - recompiling the module!
[INFO] Compiling 35 source files to <https://builds.apache.org/job/Torque4-trunk/org.apache.torque$torque-runtime/ws/target/test-classes>
[INFO]
[INFO] --- maven-surefire-plugin:2.19.1:test (default-test) @ torque-runtime ---
[WARNING] The parameter forkMode is deprecated since version 2.14. Use forkCount and reuseForks instead.

-------------------------------------------------------
 T E S T S
-------------------------------------------------------
Running org.apache.torque.sql.QueryTest
Tests run: 2, Failures: 0, Errors: 0, Skipped: 0, Time elapsed: 0.138 sec - in org.apache.torque.sql.QueryTest
Running org.apache.torque.sql.SqlBuilderTest
Tests run: 130, Failures: 0, Errors: 0, Skipped: 0, Time elapsed: 0.546 sec - in org.apache.torque.sql.SqlBuilderTest
Running org.apache.torque.util.BasePeerImplTest
Tests run: 16, Failures: 0, Errors: 0, Skipped: 0, Time elapsed: 0.732 sec - in org.apache.torque.util.BasePeerImplTest
Running org.apache.torque.util.UniqueListTest
Tests run: 2, Failures: 0, Errors: 0, Skipped: 0, Time elapsed: 0.038 sec - in org.apache.torque.util.UniqueListTest
Running org.apache.torque.util.functions.CountTest
Tests run: 4, Failures: 0, Errors: 0, Skipped: 0, Time elapsed: 0.055 sec - in org.apache.torque.util.functions.CountTest
Running org.apache.torque.util.functions.AbstractFunctionTest
Tests run: 11, Failures: 0, Errors: 0, Skipped: 0, Time elapsed: 0.071 sec - in org.apache.torque.util.functions.AbstractFunctionTest
Running org.apache.torque.util.functions.MinTest
Tests run: 4, Failures: 0, Errors: 0, Skipped: 0, Time elapsed: 0.047 sec - in org.apache.torque.util.functions.MinTest
Running org.apache.torque.util.functions.AvgTest
Tests run: 4, Failures: 0, Errors: 0, Skipped: 0, Time elapsed: 0.05 sec - in org.apache.torque.util.functions.AvgTest
Running org.apache.torque.util.functions.MaxTest
Tests run: 4, Failures: 0, Errors: 0, Skipped: 0, Time elapsed: 0.048 sec - in org.apache.torque.util.functions.MaxTest
Running org.apache.torque.util.functions.AggregateFunctionTest
Tests run: 12, Failures: 0, Errors: 0, Skipped: 0, Time elapsed: 0.045 sec - in org.apache.torque.util.functions.AggregateFunctionTest
Running org.apache.torque.util.functions.SumTest
Tests run: 4, Failures: 0, Errors: 0, Skipped: 0, Time elapsed: 0.038 sec - in org.apache.torque.util.functions.SumTest
Running org.apache.torque.util.SummaryHelperTest
Tests run: 1, Failures: 0, Errors: 0, Skipped: 0, Time elapsed: 0.646 sec - in org.apache.torque.util.SummaryHelperTest
Running org.apache.torque.ColumnImplTest
Tests run: 41, Failures: 0, Errors: 0, Skipped: 0, Time elapsed: 0.332 sec - in org.apache.torque.ColumnImplTest
Running org.apache.torque.manager.MethodResultCacheTest
Jul 03, 2018 2:58:40 PM org.apache.commons.jcs.engine.control.CompositeCacheManager getInstance
INFO: Instance is null, creating with config [/cache.ccf]
Jul 03, 2018 2:58:40 PM org.apache.commons.jcs.engine.control.CompositeCacheManager configure
INFO: Creating cache manager from config file: /cache.ccf
Jul 03, 2018 2:58:40 PM org.apache.commons.jcs.utils.threadpool.ThreadPoolManager loadConfig
INFO: thread_pool.default PoolConfiguration = useBoundary = [false] boundarySize = [2000] maximumPoolSize = [150] minimumPoolSize = [4] keepAliveTime = [300000] whenBlockedPolicy = [RUN] startUpSize = [4]
Jul 03, 2018 2:58:40 PM org.apache.commons.jcs.engine.control.CompositeCacheManager doConfigure
INFO: Setting default auxiliaries to
Jul 03, 2018 2:58:40 PM org.apache.commons.jcs.engine.control.CompositeCacheManager doConfigure
INFO: setting defaultCompositeCacheAttributes to [ useLateral = true, useRemote = true, useDisk = true, maxObjs = 1000, maxSpoolPerRun = -1, diskUsagePattern = SWAP, spoolChunkSize = 2 ]
Jul 03, 2018 2:58:40 PM org.apache.commons.jcs.engine.control.CompositeCacheConfigurator parseElementAttributes
INFO: No special ElementAttribute class defined for key [jcs.default.elementattributes], using default class.
Jul 03, 2018 2:58:40 PM org.apache.commons.jcs.engine.control.CompositeCacheManager doConfigure
INFO: setting defaultElementAttributes to [ IS_LATERAL = true, IS_SPOOL = true, IS_REMOTE = true, IS_ETERNAL = true, MaxLifeSeconds = -1, IdleTime = -1, CreateTime = 1530629920804, LastAccessTime = 1530629920804, getTimeToLiveSeconds() = -1, createTime = 1530629920804 ]
Jul 03, 2018 2:58:40 PM org.apache.commons.jcs.engine.control.CompositeCacheConfigurator parseElementAttributes
INFO: No special ElementAttribute class defined for key [jcs.region.testCache1.elementattributes], using default class.
Jul 03, 2018 2:58:40 PM org.apache.commons.jcs.engine.memory.AbstractDoubleLinkedListMemoryCache initialize
INFO: initialized MemoryCache for testCache1
Jul 03, 2018 2:58:40 PM org.apache.commons.jcs.engine.control.CompositeCache <init>
INFO: Constructed cache with name [testCache1] and cache attributes [ useLateral = true, useRemote = true, useDisk = true, maxObjs = 1000, maxSpoolPerRun = -1, diskUsagePattern = SWAP, spoolChunkSize = 2 ]
Jul 03, 2018 2:58:40 PM org.apache.commons.jcs.engine.control.CompositeCacheConfigurator parseRegions
INFO: Parsed regions [testCache1]
Jul 03, 2018 2:58:40 PM org.apache.commons.jcs.engine.control.CompositeCacheManager doConfigure
INFO: Finished configuration in 48 ms.
Tests run: 3, Failures: 0, Errors: 0, Skipped: 0, Time elapsed: 0.469 sec - in org.apache.torque.manager.MethodResultCacheTest
Running org.apache.torque.manager.AbstractBaseManagerTest
Jul 03, 2018 2:58:41 PM org.apache.commons.jcs.engine.control.CompositeCacheManager getInstance
INFO: Instance is null, creating with config [/cache.ccf]
Jul 03, 2018 2:58:41 PM org.apache.commons.jcs.engine.control.CompositeCacheManager configure
INFO: Creating cache manager from config file: /cache.ccf
Jul 03, 2018 2:58:41 PM org.apache.commons.jcs.utils.threadpool.ThreadPoolManager loadConfig
INFO: thread_pool.default PoolConfiguration = useBoundary = [false] boundarySize = [2000] maximumPoolSize = [150] minimumPoolSize = [4] keepAliveTime = [300000] whenBlockedPolicy = [RUN] startUpSize = [4]
Jul 03, 2018 2:58:41 PM org.apache.commons.jcs.engine.control.CompositeCacheManager doConfigure
INFO: Setting default auxiliaries to
Jul 03, 2018 2:58:41 PM org.apache.commons.jcs.engine.control.CompositeCacheManager doConfigure
INFO: setting defaultCompositeCacheAttributes to [ useLateral = true, useRemote = true, useDisk = true, maxObjs = 1000, maxSpoolPerRun = -1, diskUsagePattern = SWAP, spoolChunkSize = 2 ]
Jul 03, 2018 2:58:41 PM org.apache.commons.jcs.engine.control.CompositeCacheConfigurator parseElementAttributes
INFO: No special ElementAttribute class defined for key [jcs.default.elementattributes], using default class.
Jul 03, 2018 2:58:41 PM org.apache.commons.jcs.engine.control.CompositeCacheManager doConfigure
INFO: setting defaultElementAttributes to [ IS_LATERAL = true, IS_SPOOL = true, IS_REMOTE = true, IS_ETERNAL = true, MaxLifeSeconds = -1, IdleTime = -1, CreateTime = 1530629921856, LastAccessTime = 1530629921856, getTimeToLiveSeconds() = -1, createTime = 1530629921856 ]
Jul 03, 2018 2:58:41 PM org.apache.commons.jcs.engine.control.CompositeCacheConfigurator parseElementAttributes
INFO: No special ElementAttribute class defined for key [jcs.region.testCache1.elementattributes], using default class.
Jul 03, 2018 2:58:41 PM org.apache.commons.jcs.engine.memory.AbstractDoubleLinkedListMemoryCache initialize
INFO: initialized MemoryCache for testCache1
Jul 03, 2018 2:58:41 PM org.apache.commons.jcs.engine.control.CompositeCache <init>
INFO: Constructed cache with name [testCache1] and cache attributes [ useLateral = true, useRemote = true, useDisk = true, maxObjs = 1000, maxSpoolPerRun = -1, diskUsagePattern = SWAP, spoolChunkSize = 2 ]
Jul 03, 2018 2:58:41 PM org.apache.commons.jcs.engine.control.CompositeCacheConfigurator parseRegions
INFO: Parsed regions [testCache1]
Jul 03, 2018 2:58:41 PM org.apache.commons.jcs.engine.control.CompositeCacheManager doConfigure
INFO: Finished configuration in 31 ms.
Tests run: 9, Failures: 0, Errors: 0, Skipped: 0, Time elapsed: 0.396 sec - in org.apache.torque.manager.AbstractBaseManagerTest
Running org.apache.torque.avalon.AvalonTest
[WARNING] Unable to find any resource with the name '/componentConfiguration.properties'
[WARNING] Unable to find any resource with the name '/parameters.properties'
[INFO] YaffiContainer ready.
[INFO] YaffiContainer has been disposed.
[WARNING] Unable to find any resource with the name '/componentConfiguration.properties'
[WARNING] Unable to find any resource with the name '/parameters.properties'
[INFO] YaffiContainer ready.
[INFO] YaffiContainer has been disposed.
Tests run: 2, Failures: 0, Errors: 0, Skipped: 0, Time elapsed: 0.313 sec - in org.apache.torque.avalon.AvalonTest
Running org.apache.torque.map.ColumnMapTest
Tests run: 3, Failures: 0, Errors: 0, Skipped: 0, Time elapsed: 0.201 sec - in org.apache.torque.map.ColumnMapTest
Running org.apache.torque.adapter.DBOracleTest
Tests run: 1, Failures: 0, Errors: 0, Skipped: 0, Time elapsed: 0.059 sec - in org.apache.torque.adapter.DBOracleTest
Running org.apache.torque.TorqueRuntimeExceptionTest
Tests run: 1, Failures: 0, Errors: 0, Skipped: 0, Time elapsed: 0.195 sec - in org.apache.torque.TorqueRuntimeExceptionTest
Running org.apache.torque.criteria.CriteriaTest
Tests run: 33, Failures: 0, Errors: 0, Skipped: 0, Time elapsed: 0.496 sec - in org.apache.torque.criteria.CriteriaTest
Running org.apache.torque.criteria.JoinTest
Tests run: 2, Failures: 0, Errors: 0, Skipped: 0, Time elapsed: 0.179 sec - in org.apache.torque.criteria.JoinTest
Running org.apache.torque.criteria.CriterionTest
Tests run: 10, Failures: 0, Errors: 0, Skipped: 0, Time elapsed: 0.186 sec - in org.apache.torque.criteria.CriterionTest
Running org.apache.torque.om.mapper.CompositeMapperTest
Tests run: 2, Failures: 0, Errors: 0, Skipped: 0, Time elapsed: 0.473 sec - in org.apache.torque.om.mapper.CompositeMapperTest
Running org.apache.torque.om.mapper.ObjectListMapperTest
Tests run: 12, Failures: 0, Errors: 0, Skipped: 0, Time elapsed: 0.663 sec - in org.apache.torque.om.mapper.ObjectListMapperTest
Running org.apache.torque.om.mapper.StringMapperTest
Tests run: 3, Failures: 0, Errors: 0, Skipped: 0, Time elapsed: 0.513 sec - in org.apache.torque.om.mapper.StringMapperTest
Running org.apache.torque.om.mapper.LongMapperTest
Tests run: 3, Failures: 0, Errors: 0, Skipped: 0, Time elapsed: 0.516 sec - in org.apache.torque.om.mapper.LongMapperTest
Running org.apache.torque.om.mapper.BigDecimalMapperTest
Tests run: 3, Failures: 0, Errors: 0, Skipped: 0, Time elapsed: 0.472 sec - in org.apache.torque.om.mapper.BigDecimalMapperTest
Running org.apache.torque.om.mapper.DateMapperTest
Tests run: 3, Failures: 0, Errors: 0, Skipped: 0, Time elapsed: 0.524 sec - in org.apache.torque.om.mapper.DateMapperTest
Running org.apache.torque.om.mapper.IntegerMapperTest
Tests run: 3, Failures: 0, Errors: 0, Skipped: 0, Time elapsed: 0.545 sec - in org.apache.torque.om.mapper.IntegerMapperTest
Running org.apache.torque.om.NumberKeyTest
Tests run: 23, Failures: 0, Errors: 0, Skipped: 0, Time elapsed: 0.048 sec - in org.apache.torque.om.NumberKeyTest
Running org.apache.torque.om.ComboKeyTest
Tests run: 9, Failures: 0, Errors: 0, Skipped: 0, Time elapsed: 0.058 sec - in org.apache.torque.om.ComboKeyTest
Running org.apache.torque.TorqueInstanceTest
Tests run: 5, Failures: 0, Errors: 0, Skipped: 0, Time elapsed: 0.214 sec - in org.apache.torque.TorqueInstanceTest

Results :

Tests run: 365, Failures: 0, Errors: 0, Skipped: 0

[JENKINS] Recording test results
[WARNING] Attempt to (de-)serialize anonymous class hudson.maven.reporters.SurefireArchiver$2; see: https://jenkins.io/redirect/serialization-of-anonymous-classes/
[WARNING] Attempt to (de-)serialize anonymous class hudson.maven.reporters.BuildInfoRecorder$1; see: https://jenkins.io/redirect/serialization-of-anonymous-classes/
[INFO]
[INFO] --- maven-jar-plugin:3.0.0:jar (default-jar) @ torque-runtime ---
[INFO] Building jar: <https://builds.apache.org/job/Torque4-trunk/org.apache.torque$torque-runtime/ws/target/torque-runtime-4.1-SNAPSHOT.jar>
[INFO]
[INFO] --- maven-site-plugin:3.5.1:attach-descriptor (attach-descriptor) @ torque-runtime ---
[INFO]
[INFO] --- maven-source-plugin:3.0.0:jar-no-fork (attach-sources) @ torque-runtime ---
[INFO] Building jar: <https://builds.apache.org/job/Torque4-trunk/org.apache.torque$torque-runtime/ws/target/torque-runtime-4.1-SNAPSHOT-sources.jar>
[INFO]
[INFO] --- apache-rat-plugin:0.11:check (default) @ torque-runtime ---
[INFO] 51 implicit excludes (use -debug for more details).
[INFO] Exclude: velocity.log
[INFO] Exclude: .checkstyle
[INFO] Exclude: checkstyle-cache.ccf
[INFO] Exclude: derby.log
[INFO] Exclude: LICENSE-EDL.txt
[INFO] Exclude: DEPENDENCIES
[INFO] Exclude: torque-test/target/**/*
[INFO] Exclude: torque-test/.classpath
[INFO] Exclude: torque-test/.project
[INFO] Exclude: torque-test/.settings/**
[INFO] Exclude: torque-test/src/main/generated-java/**/*
[INFO] Exclude: torque-test/derby.log
[INFO] 182 resources included (use -debug for more details)
[INFO] Rat check: Summary of files. Unapproved: 0 unknown: 0 generated: 0 approved: 180 licence.
[CHECKSTYLE] No report found for mojo check
[PMD] No report found for mojo check
[INFO]
[INFO] --- maven-install-plugin:2.5.2:install (default-install) @ torque-runtime ---
[INFO] Installing <https://builds.apache.org/job/Torque4-trunk/org.apache.torque$torque-runtime/ws/target/torque-runtime-4.1-SNAPSHOT.jar> to /home/jenkins/jenkins-slave/maven-repositories/0/org/apache/torque/torque-runtime/4.1-SNAPSHOT/torque-runtime-4.1-SNAPSHOT.jar
[INFO] Installing <https://builds.apache.org/job/Torque4-trunk/org.apache.torque$torque-runtime/ws/pom.xml> to /home/jenkins/jenkins-slave/maven-repositories/0/org/apache/torque/torque-runtime/4.1-SNAPSHOT/torque-runtime-4.1-SNAPSHOT.pom
[INFO] Installing <https://builds.apache.org/job/Torque4-trunk/org.apache.torque$torque-runtime/ws/target/torque-runtime-4.1-SNAPSHOT-sources.jar> to /home/jenkins/jenkins-slave/maven-repositories/0/org/apache/torque/torque-runtime/4.1-SNAPSHOT/torque-runtime-4.1-SNAPSHOT-sources.jar
[INFO]
[INFO] >>> cobertura-maven-plugin:2.3:cobertura (default-cli) > [cobertura]test @ torque-runtime >>>
[INFO]
[INFO] --- maven-remote-resources-plugin:1.5:process (process-resource-bundles) @ torque-runtime ---
[INFO]
[INFO] --- maven-resources-plugin:2.7:resources (default-resources) @ torque-runtime ---
[INFO] Using 'ISO-8859-1' encoding to copy filtered resources.
[INFO] skip non existing resourceDirectory <https://builds.apache.org/job/Torque4-trunk/org.apache.torque$torque-runtime/ws/src/main/resources>
[INFO] Copying 3 resources
[INFO] Copying 3 resources
[INFO]
[INFO] --- maven-compiler-plugin:3.5.1:compile (default-compile) @ torque-runtime ---
[INFO] Nothing to compile - all classes are up to date
[INFO]
[INFO] --- cobertura-maven-plugin:2.3:instrument (default-cli) @ torque-runtime ---
[INFO] Cobertura 1.9.2 - GNU GPL License (NO WARRANTY) - See COPYRIGHT file
Instrumenting 122 files to <https://builds.apache.org/job/Torque4-trunk/org.apache.torque$torque-runtime/ws/target/generated-classes/cobertura>
Cobertura: Saved information on 122 classes.
Instrument time: 496ms

[INFO] Instrumentation was successful.
[INFO]
[INFO] --- maven-resources-plugin:2.7:testResources (default-testResources) @ torque-runtime ---
[INFO] Using 'ISO-8859-1' encoding to copy filtered resources.
[INFO] Copying 5 resources
[INFO] Copying 3 resources
[INFO] Copying 3 resources
[INFO]
[INFO] --- maven-compiler-plugin:3.5.1:testCompile (default-testCompile) @ torque-runtime ---
[INFO] Nothing to compile - all classes are up to date
[INFO]
[INFO] --- maven-surefire-plugin:2.19.1:test (default-test) @ torque-runtime ---

-------------------------------------------------------
 T E S T S
-------------------------------------------------------

Results :

Tests run: 0, Failures: 0, Errors: 0, Skipped: 0

[JENKINS] Recording test results

---------------------------------------------------------------------
To unsubscribe, e-mail: [hidden email]
For additional commands, e-mail: [hidden email]

Reply | Threaded
Open this post in threaded view
|

Build failed in Jenkins: Torque4-trunk » Torque Runtime #579

Apache Jenkins Server-2
See <https://builds.apache.org/job/Torque4-trunk/org.apache.torque$torque-runtime/579/display/redirect>

------------------------------------------
[...truncated 2.66 KB...]
[INFO] Downloading from central: https://repo.maven.apache.org/maven2/org/apache/commons/commons-jcs-core/2.2/commons-jcs-core-2.2.jar
[INFO] Downloading from central: https://repo.maven.apache.org/maven2/junit/junit/4.8.1/junit-4.8.1.jar
[INFO] Downloading from central: https://repo.maven.apache.org/maven2/org/apache/fulcrum/fulcrum-testcontainer/1.0.7/fulcrum-testcontainer-1.0.7.jar
[INFO] Downloading from central: https://repo.maven.apache.org/maven2/org/apache/fulcrum/fulcrum-yaafi/1.0.6/fulcrum-yaafi-1.0.6.jar
[INFO] Downloaded from central: https://repo.maven.apache.org/maven2/org/apache/commons/commons-dbcp2/2.2.0/commons-dbcp2-2.2.0.jar (187 kB at 4.9 MB/s)
[INFO] Downloading from central: https://repo.maven.apache.org/maven2/org/mockito/mockito-all/1.9.0/mockito-all-1.9.0.jar
[INFO] Downloaded from central: https://repo.maven.apache.org/maven2/junit/junit/4.8.1/junit-4.8.1.jar (237 kB at 6.2 MB/s)
[INFO] Downloaded from central: https://repo.maven.apache.org/maven2/org/apache/commons/commons-jcs-core/2.2/commons-jcs-core-2.2.jar (535 kB at 7.4 MB/s)
[INFO] Downloaded from central: https://repo.maven.apache.org/maven2/org/mockito/mockito-all/1.9.0/mockito-all-1.9.0.jar (1.5 MB at 11 MB/s)
[INFO] Downloaded from central: https://repo.maven.apache.org/maven2/org/apache/fulcrum/fulcrum-testcontainer/1.0.7/fulcrum-testcontainer-1.0.7.jar (16 kB at 96 kB/s)
[INFO] Downloaded from central: https://repo.maven.apache.org/maven2/org/apache/fulcrum/fulcrum-yaafi/1.0.6/fulcrum-yaafi-1.0.6.jar (130 kB at 736 kB/s)
[INFO]
[INFO] --- maven-clean-plugin:3.0.0:clean (default-clean) @ torque-runtime ---
[INFO]
[INFO] --- maven-remote-resources-plugin:1.5:process (process-resource-bundles) @ torque-runtime ---
[INFO]
[INFO] --- maven-resources-plugin:2.7:resources (default-resources) @ torque-runtime ---
[INFO] Using 'ISO-8859-1' encoding to copy filtered resources.
[INFO] skip non existing resourceDirectory <https://builds.apache.org/job/Torque4-trunk/org.apache.torque$torque-runtime/ws/src/main/resources>
[INFO] Copying 3 resources
[INFO]
[INFO] --- maven-compiler-plugin:3.5.1:compile (default-compile) @ torque-runtime ---
[INFO] Changes detected - recompiling the module!
[INFO] Compiling 119 source files to <https://builds.apache.org/job/Torque4-trunk/org.apache.torque$torque-runtime/ws/target/classes>
[INFO]
[INFO] --- maven-resources-plugin:2.7:testResources (default-testResources) @ torque-runtime ---
[INFO] Using 'ISO-8859-1' encoding to copy filtered resources.
[INFO] Copying 5 resources
[INFO] Copying 3 resources
[INFO]
[INFO] --- maven-compiler-plugin:3.5.1:testCompile (default-testCompile) @ torque-runtime ---
[INFO] Changes detected - recompiling the module!
[INFO] Compiling 35 source files to <https://builds.apache.org/job/Torque4-trunk/org.apache.torque$torque-runtime/ws/target/test-classes>
[INFO]
[INFO] --- maven-surefire-plugin:2.19.1:test (default-test) @ torque-runtime ---
[WARNING] The parameter forkMode is deprecated since version 2.14. Use forkCount and reuseForks instead.

-------------------------------------------------------
 T E S T S
-------------------------------------------------------
Running org.apache.torque.TorqueInstanceTest
Tests run: 5, Failures: 0, Errors: 0, Skipped: 0, Time elapsed: 0.192 sec - in org.apache.torque.TorqueInstanceTest
Running org.apache.torque.TorqueRuntimeExceptionTest
Tests run: 1, Failures: 0, Errors: 0, Skipped: 0, Time elapsed: 0.218 sec - in org.apache.torque.TorqueRuntimeExceptionTest
Running org.apache.torque.criteria.JoinTest
Tests run: 2, Failures: 0, Errors: 0, Skipped: 0, Time elapsed: 0.218 sec - in org.apache.torque.criteria.JoinTest
Running org.apache.torque.criteria.CriterionTest
Tests run: 10, Failures: 0, Errors: 0, Skipped: 0, Time elapsed: 0.228 sec - in org.apache.torque.criteria.CriterionTest
Running org.apache.torque.criteria.CriteriaTest
Tests run: 33, Failures: 0, Errors: 0, Skipped: 0, Time elapsed: 0.514 sec - in org.apache.torque.criteria.CriteriaTest
Running org.apache.torque.manager.AbstractBaseManagerTest
Aug 15, 2018 1:25:19 PM org.apache.commons.jcs.engine.control.CompositeCacheManager getInstance
INFO: Instance is null, creating with config [/cache.ccf]
Aug 15, 2018 1:25:19 PM org.apache.commons.jcs.engine.control.CompositeCacheManager configure
INFO: Creating cache manager from config file: /cache.ccf
Aug 15, 2018 1:25:19 PM org.apache.commons.jcs.utils.threadpool.ThreadPoolManager loadConfig
INFO: thread_pool.default PoolConfiguration = useBoundary = [false] boundarySize = [2000] maximumPoolSize = [150] minimumPoolSize = [4] keepAliveTime = [300000] whenBlockedPolicy = [RUN] startUpSize = [4]
Aug 15, 2018 1:25:19 PM org.apache.commons.jcs.engine.control.CompositeCacheManager doConfigure
INFO: Setting default auxiliaries to
Aug 15, 2018 1:25:19 PM org.apache.commons.jcs.engine.control.CompositeCacheManager doConfigure
INFO: setting defaultCompositeCacheAttributes to [ useLateral = true, useRemote = true, useDisk = true, maxObjs = 1000, maxSpoolPerRun = -1, diskUsagePattern = SWAP, spoolChunkSize = 2 ]
Aug 15, 2018 1:25:19 PM org.apache.commons.jcs.engine.control.CompositeCacheConfigurator parseElementAttributes
INFO: No special ElementAttribute class defined for key [jcs.default.elementattributes], using default class.
Aug 15, 2018 1:25:19 PM org.apache.commons.jcs.engine.control.CompositeCacheManager doConfigure
INFO: setting defaultElementAttributes to [ IS_LATERAL = true, IS_SPOOL = true, IS_REMOTE = true, IS_ETERNAL = true, MaxLifeSeconds = -1, IdleTime = -1, CreateTime = 1534339519766, LastAccessTime = 1534339519766, getTimeToLiveSeconds() = -1, createTime = 1534339519766 ]
Aug 15, 2018 1:25:19 PM org.apache.commons.jcs.engine.control.CompositeCacheConfigurator parseElementAttributes
INFO: No special ElementAttribute class defined for key [jcs.region.testCache1.elementattributes], using default class.
Aug 15, 2018 1:25:19 PM org.apache.commons.jcs.engine.memory.AbstractDoubleLinkedListMemoryCache initialize
INFO: initialized MemoryCache for testCache1
Aug 15, 2018 1:25:19 PM org.apache.commons.jcs.engine.control.CompositeCache <init>
INFO: Constructed cache with name [testCache1] and cache attributes [ useLateral = true, useRemote = true, useDisk = true, maxObjs = 1000, maxSpoolPerRun = -1, diskUsagePattern = SWAP, spoolChunkSize = 2 ]
Aug 15, 2018 1:25:19 PM org.apache.commons.jcs.engine.control.CompositeCacheConfigurator parseRegions
INFO: Parsed regions [testCache1]
Aug 15, 2018 1:25:19 PM org.apache.commons.jcs.engine.control.CompositeCacheManager doConfigure
INFO: Finished configuration in 34 ms.
Tests run: 9, Failures: 0, Errors: 0, Skipped: 0, Time elapsed: 0.417 sec - in org.apache.torque.manager.AbstractBaseManagerTest
Running org.apache.torque.manager.MethodResultCacheTest
Aug 15, 2018 1:25:20 PM org.apache.commons.jcs.engine.control.CompositeCacheManager getInstance
INFO: Instance is null, creating with config [/cache.ccf]
Aug 15, 2018 1:25:20 PM org.apache.commons.jcs.engine.control.CompositeCacheManager configure
INFO: Creating cache manager from config file: /cache.ccf
Aug 15, 2018 1:25:20 PM org.apache.commons.jcs.utils.threadpool.ThreadPoolManager loadConfig
INFO: thread_pool.default PoolConfiguration = useBoundary = [false] boundarySize = [2000] maximumPoolSize = [150] minimumPoolSize = [4] keepAliveTime = [300000] whenBlockedPolicy = [RUN] startUpSize = [4]
Aug 15, 2018 1:25:20 PM org.apache.commons.jcs.engine.control.CompositeCacheManager doConfigure
INFO: Setting default auxiliaries to
Aug 15, 2018 1:25:20 PM org.apache.commons.jcs.engine.control.CompositeCacheManager doConfigure
INFO: setting defaultCompositeCacheAttributes to [ useLateral = true, useRemote = true, useDisk = true, maxObjs = 1000, maxSpoolPerRun = -1, diskUsagePattern = SWAP, spoolChunkSize = 2 ]
Aug 15, 2018 1:25:20 PM org.apache.commons.jcs.engine.control.CompositeCacheConfigurator parseElementAttributes
INFO: No special ElementAttribute class defined for key [jcs.default.elementattributes], using default class.
Aug 15, 2018 1:25:20 PM org.apache.commons.jcs.engine.control.CompositeCacheManager doConfigure
INFO: setting defaultElementAttributes to [ IS_LATERAL = true, IS_SPOOL = true, IS_REMOTE = true, IS_ETERNAL = true, MaxLifeSeconds = -1, IdleTime = -1, CreateTime = 1534339520829, LastAccessTime = 1534339520829, getTimeToLiveSeconds() = -1, createTime = 1534339520829 ]
Aug 15, 2018 1:25:20 PM org.apache.commons.jcs.engine.control.CompositeCacheConfigurator parseElementAttributes
INFO: No special ElementAttribute class defined for key [jcs.region.testCache1.elementattributes], using default class.
Aug 15, 2018 1:25:20 PM org.apache.commons.jcs.engine.memory.AbstractDoubleLinkedListMemoryCache initialize
INFO: initialized MemoryCache for testCache1
Aug 15, 2018 1:25:20 PM org.apache.commons.jcs.engine.control.CompositeCache <init>
INFO: Constructed cache with name [testCache1] and cache attributes [ useLateral = true, useRemote = true, useDisk = true, maxObjs = 1000, maxSpoolPerRun = -1, diskUsagePattern = SWAP, spoolChunkSize = 2 ]
Aug 15, 2018 1:25:20 PM org.apache.commons.jcs.engine.control.CompositeCacheConfigurator parseRegions
INFO: Parsed regions [testCache1]
Aug 15, 2018 1:25:20 PM org.apache.commons.jcs.engine.control.CompositeCacheManager doConfigure
INFO: Finished configuration in 47 ms.
Tests run: 3, Failures: 0, Errors: 0, Skipped: 0, Time elapsed: 0.443 sec - in org.apache.torque.manager.MethodResultCacheTest
Aug 15, 2018 1:25:20 PM org.apache.commons.jcs.engine.control.CompositeCacheManager run
INFO: Shutdown hook activated.  Shutdown was not called.  Shutting down JCS.
Running org.apache.torque.adapter.DBOracleTest
Tests run: 1, Failures: 0, Errors: 0, Skipped: 0, Time elapsed: 0.06 sec - in org.apache.torque.adapter.DBOracleTest
Running org.apache.torque.om.ComboKeyTest
Tests run: 9, Failures: 0, Errors: 0, Skipped: 0, Time elapsed: 0.059 sec - in org.apache.torque.om.ComboKeyTest
Running org.apache.torque.om.mapper.DateMapperTest
Tests run: 3, Failures: 0, Errors: 0, Skipped: 0, Time elapsed: 0.489 sec - in org.apache.torque.om.mapper.DateMapperTest
Running org.apache.torque.om.mapper.CompositeMapperTest
Tests run: 2, Failures: 0, Errors: 0, Skipped: 0, Time elapsed: 0.521 sec - in org.apache.torque.om.mapper.CompositeMapperTest
Running org.apache.torque.om.mapper.ObjectListMapperTest
Tests run: 12, Failures: 0, Errors: 0, Skipped: 0, Time elapsed: 0.703 sec - in org.apache.torque.om.mapper.ObjectListMapperTest
Running org.apache.torque.om.mapper.IntegerMapperTest
Tests run: 3, Failures: 0, Errors: 0, Skipped: 0, Time elapsed: 0.513 sec - in org.apache.torque.om.mapper.IntegerMapperTest
Running org.apache.torque.om.mapper.BigDecimalMapperTest
Tests run: 3, Failures: 0, Errors: 0, Skipped: 0, Time elapsed: 0.547 sec - in org.apache.torque.om.mapper.BigDecimalMapperTest
Running org.apache.torque.om.mapper.StringMapperTest
Tests run: 3, Failures: 0, Errors: 0, Skipped: 0, Time elapsed: 0.432 sec - in org.apache.torque.om.mapper.StringMapperTest
Running org.apache.torque.om.mapper.LongMapperTest
Tests run: 3, Failures: 0, Errors: 0, Skipped: 0, Time elapsed: 0.567 sec - in org.apache.torque.om.mapper.LongMapperTest
Running org.apache.torque.om.NumberKeyTest
Tests run: 23, Failures: 0, Errors: 0, Skipped: 0, Time elapsed: 0.06 sec - in org.apache.torque.om.NumberKeyTest
Running org.apache.torque.avalon.AvalonTest
[WARNING] Unable to find any resource with the name '/componentConfiguration.properties'
[WARNING] Unable to find any resource with the name '/parameters.properties'
[INFO] YaffiContainer ready.
[INFO] YaffiContainer has been disposed.
[WARNING] Unable to find any resource with the name '/componentConfiguration.properties'
[WARNING] Unable to find any resource with the name '/parameters.properties'
[INFO] YaffiContainer ready.
[INFO] YaffiContainer has been disposed.
Tests run: 2, Failures: 0, Errors: 0, Skipped: 0, Time elapsed: 0.353 sec - in org.apache.torque.avalon.AvalonTest
Running org.apache.torque.util.functions.MaxTest
Tests run: 4, Failures: 0, Errors: 0, Skipped: 0, Time elapsed: 0.037 sec - in org.apache.torque.util.functions.MaxTest
Running org.apache.torque.util.functions.AggregateFunctionTest
Tests run: 12, Failures: 0, Errors: 0, Skipped: 0, Time elapsed: 0.058 sec - in org.apache.torque.util.functions.AggregateFunctionTest
Running org.apache.torque.util.functions.AbstractFunctionTest
Tests run: 11, Failures: 0, Errors: 0, Skipped: 0, Time elapsed: 0.054 sec - in org.apache.torque.util.functions.AbstractFunctionTest
Running org.apache.torque.util.functions.MinTest
Tests run: 4, Failures: 0, Errors: 0, Skipped: 0, Time elapsed: 0.053 sec - in org.apache.torque.util.functions.MinTest
Running org.apache.torque.util.functions.SumTest
Tests run: 4, Failures: 0, Errors: 0, Skipped: 0, Time elapsed: 0.057 sec - in org.apache.torque.util.functions.SumTest
Running org.apache.torque.util.functions.AvgTest
Tests run: 4, Failures: 0, Errors: 0, Skipped: 0, Time elapsed: 0.056 sec - in org.apache.torque.util.functions.AvgTest
Running org.apache.torque.util.functions.CountTest
Tests run: 4, Failures: 0, Errors: 0, Skipped: 0, Time elapsed: 0.051 sec - in org.apache.torque.util.functions.CountTest
Running org.apache.torque.util.BasePeerImplTest
Tests run: 16, Failures: 0, Errors: 0, Skipped: 0, Time elapsed: 0.681 sec - in org.apache.torque.util.BasePeerImplTest
Running org.apache.torque.util.UniqueListTest
Tests run: 2, Failures: 0, Errors: 0, Skipped: 0, Time elapsed: 0.041 sec - in org.apache.torque.util.UniqueListTest
Running org.apache.torque.util.SummaryHelperTest
Tests run: 1, Failures: 0, Errors: 0, Skipped: 0, Time elapsed: 0.609 sec - in org.apache.torque.util.SummaryHelperTest
Running org.apache.torque.ColumnImplTest
Tests run: 41, Failures: 0, Errors: 0, Skipped: 0, Time elapsed: 0.3 sec - in org.apache.torque.ColumnImplTest
Running org.apache.torque.map.ColumnMapTest
Tests run: 3, Failures: 0, Errors: 0, Skipped: 0, Time elapsed: 0.192 sec - in org.apache.torque.map.ColumnMapTest
Running org.apache.torque.sql.QueryTest
Tests run: 2, Failures: 0, Errors: 0, Skipped: 0, Time elapsed: 0.179 sec - in org.apache.torque.sql.QueryTest
Running org.apache.torque.sql.SqlBuilderTest
Tests run: 130, Failures: 0, Errors: 0, Skipped: 0, Time elapsed: 0.615 sec - in org.apache.torque.sql.SqlBuilderTest

Results :

Tests run: 365, Failures: 0, Errors: 0, Skipped: 0

[JENKINS] Recording test results
[WARNING] Attempt to (de-)serialize anonymous class hudson.maven.reporters.SurefireArchiver$2; see: https://jenkins.io/redirect/serialization-of-anonymous-classes/
[WARNING] Attempt to (de-)serialize anonymous class hudson.maven.reporters.BuildInfoRecorder$1; see: https://jenkins.io/redirect/serialization-of-anonymous-classes/
[INFO]
[INFO] --- maven-jar-plugin:3.0.0:jar (default-jar) @ torque-runtime ---
[INFO] Building jar: <https://builds.apache.org/job/Torque4-trunk/org.apache.torque$torque-runtime/ws/target/torque-runtime-4.1-SNAPSHOT.jar>
[INFO]
[INFO] --- maven-site-plugin:3.5.1:attach-descriptor (attach-descriptor) @ torque-runtime ---
[INFO]
[INFO] --- maven-source-plugin:3.0.0:jar-no-fork (attach-sources) @ torque-runtime ---
[INFO] Building jar: <https://builds.apache.org/job/Torque4-trunk/org.apache.torque$torque-runtime/ws/target/torque-runtime-4.1-SNAPSHOT-sources.jar>
[INFO]
[INFO] --- apache-rat-plugin:0.11:check (default) @ torque-runtime ---
[INFO] 51 implicit excludes (use -debug for more details).
[INFO] Exclude: velocity.log
[INFO] Exclude: .checkstyle
[INFO] Exclude: checkstyle-cache.ccf
[INFO] Exclude: derby.log
[INFO] Exclude: LICENSE-EDL.txt
[INFO] Exclude: DEPENDENCIES
[INFO] Exclude: torque-test/target/**/*
[INFO] Exclude: torque-test/.classpath
[INFO] Exclude: torque-test/.project
[INFO] Exclude: torque-test/.settings/**
[INFO] Exclude: torque-test/src/main/generated-java/**/*
[INFO] Exclude: torque-test/derby.log
[INFO] 182 resources included (use -debug for more details)
[INFO] Rat check: Summary of files. Unapproved: 0 unknown: 0 generated: 0 approved: 180 licence.
[CHECKSTYLE] No report found for mojo check
[PMD] No report found for mojo check
[INFO]
[INFO] --- dependency-check-maven:3.1.2:check (default) @ torque-runtime ---
[INFO] Skipping dependency-check
[CHECKSTYLE] No report found for mojo check
[PMD] No report found for mojo check
[INFO]
[INFO] --- maven-install-plugin:2.5.2:install (default-install) @ torque-runtime ---
[INFO] Installing <https://builds.apache.org/job/Torque4-trunk/org.apache.torque$torque-runtime/ws/target/torque-runtime-4.1-SNAPSHOT.jar> to /home/jenkins/jenkins-slave/maven-repositories/1/org/apache/torque/torque-runtime/4.1-SNAPSHOT/torque-runtime-4.1-SNAPSHOT.jar
[INFO] Installing <https://builds.apache.org/job/Torque4-trunk/org.apache.torque$torque-runtime/ws/pom.xml> to /home/jenkins/jenkins-slave/maven-repositories/1/org/apache/torque/torque-runtime/4.1-SNAPSHOT/torque-runtime-4.1-SNAPSHOT.pom
[INFO] Installing <https://builds.apache.org/job/Torque4-trunk/org.apache.torque$torque-runtime/ws/target/torque-runtime-4.1-SNAPSHOT-sources.jar> to /home/jenkins/jenkins-slave/maven-repositories/1/org/apache/torque/torque-runtime/4.1-SNAPSHOT/torque-runtime-4.1-SNAPSHOT-sources.jar
[INFO]
[INFO] >>> cobertura-maven-plugin:2.3:cobertura (default-cli) > [cobertura]test @ torque-runtime >>>
[INFO]
[INFO] --- maven-remote-resources-plugin:1.5:process (process-resource-bundles) @ torque-runtime ---
[INFO]
[INFO] --- maven-resources-plugin:2.7:resources (default-resources) @ torque-runtime ---
[INFO] Using 'ISO-8859-1' encoding to copy filtered resources.
[INFO] skip non existing resourceDirectory <https://builds.apache.org/job/Torque4-trunk/org.apache.torque$torque-runtime/ws/src/main/resources>
[INFO] Copying 3 resources
[INFO] Copying 3 resources
[INFO]
[INFO] --- maven-compiler-plugin:3.5.1:compile (default-compile) @ torque-runtime ---
[INFO] Nothing to compile - all classes are up to date
[INFO]
[INFO] --- cobertura-maven-plugin:2.3:instrument (default-cli) @ torque-runtime ---
[INFO] Cobertura 1.9.2 - GNU GPL License (NO WARRANTY) - See COPYRIGHT file
Instrumenting 122 files to <https://builds.apache.org/job/Torque4-trunk/org.apache.torque$torque-runtime/ws/target/generated-classes/cobertura>
Cobertura: Saved information on 122 classes.
Instrument time: 530ms

[INFO] Instrumentation was successful.
[INFO]
[INFO] --- maven-resources-plugin:2.7:testResources (default-testResources) @ torque-runtime ---
[INFO] Using 'ISO-8859-1' encoding to copy filtered resources.
[INFO] Copying 5 resources
[INFO] Copying 3 resources
[INFO] Copying 3 resources
[INFO]
[INFO] --- maven-compiler-plugin:3.5.1:testCompile (default-testCompile) @ torque-runtime ---
[INFO] Nothing to compile - all classes are up to date
[INFO]
[INFO] --- maven-surefire-plugin:2.19.1:test (default-test) @ torque-runtime ---

-------------------------------------------------------
 T E S T S
-------------------------------------------------------

Results :

Tests run: 0, Failures: 0, Errors: 0, Skipped: 0

[JENKINS] Recording test results

---------------------------------------------------------------------
To unsubscribe, e-mail: [hidden email]
For additional commands, e-mail: [hidden email]

Reply | Threaded
Open this post in threaded view
|

Build failed in Jenkins: Torque4-trunk » Torque Runtime #580

Apache Jenkins Server-2
See <https://builds.apache.org/job/Torque4-trunk/org.apache.torque$torque-runtime/580/display/redirect?page=changes>

Changes:

[tv] Handle warnings

------------------------------------------
[...truncated 1.64 KB...]
[INFO] Downloaded from central: https://repo.maven.apache.org/maven2/org/apache/fulcrum/fulcrum-parent/1/fulcrum-parent-1.pom (19 kB at 1.2 MB/s)
[INFO] Downloading from central: https://repo.maven.apache.org/maven2/org/mockito/mockito-all/1.9.0/mockito-all-1.9.0.pom
[INFO] Downloaded from central: https://repo.maven.apache.org/maven2/org/mockito/mockito-all/1.9.0/mockito-all-1.9.0.pom (1.0 kB at 84 kB/s)
[INFO] Downloading from central: https://repo.maven.apache.org/maven2/org/apache/commons/commons-jcs-core/2.2/commons-jcs-core-2.2.jar
[INFO] Downloading from central: https://repo.maven.apache.org/maven2/org/apache/fulcrum/fulcrum-testcontainer/1.0.7/fulcrum-testcontainer-1.0.7.jar
[INFO] Downloading from central: https://repo.maven.apache.org/maven2/org/apache/fulcrum/fulcrum-yaafi/1.0.6/fulcrum-yaafi-1.0.6.jar
[INFO] Downloading from central: https://repo.maven.apache.org/maven2/org/mockito/mockito-all/1.9.0/mockito-all-1.9.0.jar
[INFO] Downloaded from central: https://repo.maven.apache.org/maven2/org/apache/fulcrum/fulcrum-testcontainer/1.0.7/fulcrum-testcontainer-1.0.7.jar (16 kB at 862 kB/s)
[INFO] Downloaded from central: https://repo.maven.apache.org/maven2/org/apache/fulcrum/fulcrum-yaafi/1.0.6/fulcrum-yaafi-1.0.6.jar (130 kB at 3.4 MB/s)
[INFO] Downloaded from central: https://repo.maven.apache.org/maven2/org/apache/commons/commons-jcs-core/2.2/commons-jcs-core-2.2.jar (535 kB at 7.3 MB/s)
[INFO] Downloaded from central: https://repo.maven.apache.org/maven2/org/mockito/mockito-all/1.9.0/mockito-all-1.9.0.jar (1.5 MB at 11 MB/s)
[INFO]
[INFO] --- maven-clean-plugin:3.0.0:clean (default-clean) @ torque-runtime ---
[INFO]
[INFO] --- maven-remote-resources-plugin:1.5:process (process-resource-bundles) @ torque-runtime ---
[INFO]
[INFO] --- maven-resources-plugin:2.7:resources (default-resources) @ torque-runtime ---
[INFO] Using 'ISO-8859-1' encoding to copy filtered resources.
[INFO] skip non existing resourceDirectory <https://builds.apache.org/job/Torque4-trunk/org.apache.torque$torque-runtime/ws/src/main/resources>
[INFO] Copying 3 resources
[INFO]
[INFO] --- maven-compiler-plugin:3.5.1:compile (default-compile) @ torque-runtime ---
[INFO] Changes detected - recompiling the module!
[INFO] Compiling 119 source files to <https://builds.apache.org/job/Torque4-trunk/org.apache.torque$torque-runtime/ws/target/classes>
[INFO]
[INFO] --- maven-resources-plugin:2.7:testResources (default-testResources) @ torque-runtime ---
[INFO] Using 'ISO-8859-1' encoding to copy filtered resources.
[INFO] Copying 5 resources
[INFO] Copying 3 resources
[INFO]
[INFO] --- maven-compiler-plugin:3.5.1:testCompile (default-testCompile) @ torque-runtime ---
[INFO] Changes detected - recompiling the module!
[INFO] Compiling 35 source files to <https://builds.apache.org/job/Torque4-trunk/org.apache.torque$torque-runtime/ws/target/test-classes>
[INFO]
[INFO] --- maven-surefire-plugin:2.19.1:test (default-test) @ torque-runtime ---
[WARNING] The parameter forkMode is deprecated since version 2.14. Use forkCount and reuseForks instead.

-------------------------------------------------------
 T E S T S
-------------------------------------------------------
Running org.apache.torque.ColumnImplTest
Tests run: 41, Failures: 0, Errors: 0, Skipped: 0, Time elapsed: 0.216 sec - in org.apache.torque.ColumnImplTest
Running org.apache.torque.avalon.AvalonTest
[WARNING] Unable to find any resource with the name '/componentConfiguration.properties'
[WARNING] Unable to find any resource with the name '/parameters.properties'
[INFO] YaffiContainer ready.
[INFO] YaffiContainer has been disposed.
[WARNING] Unable to find any resource with the name '/componentConfiguration.properties'
[WARNING] Unable to find any resource with the name '/parameters.properties'
[INFO] YaffiContainer ready.
[INFO] YaffiContainer has been disposed.
Tests run: 2, Failures: 0, Errors: 0, Skipped: 0, Time elapsed: 0.282 sec - in org.apache.torque.avalon.AvalonTest
Running org.apache.torque.map.ColumnMapTest
Tests run: 3, Failures: 0, Errors: 0, Skipped: 0, Time elapsed: 0.142 sec - in org.apache.torque.map.ColumnMapTest
Running org.apache.torque.util.functions.AbstractFunctionTest
Tests run: 11, Failures: 0, Errors: 0, Skipped: 0, Time elapsed: 0.051 sec - in org.apache.torque.util.functions.AbstractFunctionTest
Running org.apache.torque.util.functions.MinTest
Tests run: 4, Failures: 0, Errors: 0, Skipped: 0, Time elapsed: 0.034 sec - in org.apache.torque.util.functions.MinTest
Running org.apache.torque.util.functions.MaxTest
Tests run: 4, Failures: 0, Errors: 0, Skipped: 0, Time elapsed: 0.035 sec - in org.apache.torque.util.functions.MaxTest
Running org.apache.torque.util.functions.AggregateFunctionTest
Tests run: 12, Failures: 0, Errors: 0, Skipped: 0, Time elapsed: 0.04 sec - in org.apache.torque.util.functions.AggregateFunctionTest
Running org.apache.torque.util.functions.AvgTest
Tests run: 4, Failures: 0, Errors: 0, Skipped: 0, Time elapsed: 0.035 sec - in org.apache.torque.util.functions.AvgTest
Running org.apache.torque.util.functions.SumTest
Tests run: 4, Failures: 0, Errors: 0, Skipped: 0, Time elapsed: 0.036 sec - in org.apache.torque.util.functions.SumTest
Running org.apache.torque.util.functions.CountTest
Tests run: 4, Failures: 0, Errors: 0, Skipped: 0, Time elapsed: 0.034 sec - in org.apache.torque.util.functions.CountTest
Running org.apache.torque.util.BasePeerImplTest
Tests run: 16, Failures: 0, Errors: 0, Skipped: 0, Time elapsed: 0.602 sec - in org.apache.torque.util.BasePeerImplTest
Running org.apache.torque.util.SummaryHelperTest
Tests run: 1, Failures: 0, Errors: 0, Skipped: 0, Time elapsed: 0.508 sec - in org.apache.torque.util.SummaryHelperTest
Running org.apache.torque.util.UniqueListTest
Tests run: 2, Failures: 0, Errors: 0, Skipped: 0, Time elapsed: 0.029 sec - in org.apache.torque.util.UniqueListTest
Running org.apache.torque.TorqueRuntimeExceptionTest
Tests run: 1, Failures: 0, Errors: 0, Skipped: 0, Time elapsed: 0.142 sec - in org.apache.torque.TorqueRuntimeExceptionTest
Running org.apache.torque.sql.SqlBuilderTest
Tests run: 130, Failures: 0, Errors: 0, Skipped: 0, Time elapsed: 0.439 sec - in org.apache.torque.sql.SqlBuilderTest
Running org.apache.torque.sql.QueryTest
Tests run: 2, Failures: 0, Errors: 0, Skipped: 0, Time elapsed: 0.184 sec - in org.apache.torque.sql.QueryTest
Running org.apache.torque.manager.AbstractBaseManagerTest
Aug 16, 2018 8:53:10 AM org.apache.commons.jcs.engine.control.CompositeCacheManager getInstance
INFO: Instance is null, creating with config [/cache.ccf]
Aug 16, 2018 8:53:10 AM org.apache.commons.jcs.engine.control.CompositeCacheManager configure
INFO: Creating cache manager from config file: /cache.ccf
Aug 16, 2018 8:53:10 AM org.apache.commons.jcs.utils.threadpool.ThreadPoolManager loadConfig
INFO: thread_pool.default PoolConfiguration = useBoundary = [false] boundarySize = [2000] maximumPoolSize = [150] minimumPoolSize = [4] keepAliveTime = [300000] whenBlockedPolicy = [RUN] startUpSize = [4]
Aug 16, 2018 8:53:10 AM org.apache.commons.jcs.engine.control.CompositeCacheManager doConfigure
INFO: Setting default auxiliaries to
Aug 16, 2018 8:53:10 AM org.apache.commons.jcs.engine.control.CompositeCacheManager doConfigure
INFO: setting defaultCompositeCacheAttributes to [ useLateral = true, useRemote = true, useDisk = true, maxObjs = 1000, maxSpoolPerRun = -1, diskUsagePattern = SWAP, spoolChunkSize = 2 ]
Aug 16, 2018 8:53:10 AM org.apache.commons.jcs.engine.control.CompositeCacheConfigurator parseElementAttributes
INFO: No special ElementAttribute class defined for key [jcs.default.elementattributes], using default class.
Aug 16, 2018 8:53:10 AM org.apache.commons.jcs.engine.control.CompositeCacheManager doConfigure
INFO: setting defaultElementAttributes to [ IS_LATERAL = true, IS_SPOOL = true, IS_REMOTE = true, IS_ETERNAL = true, MaxLifeSeconds = -1, IdleTime = -1, CreateTime = 1534409590373, LastAccessTime = 1534409590373, getTimeToLiveSeconds() = -1, createTime = 1534409590373 ]
Aug 16, 2018 8:53:10 AM org.apache.commons.jcs.engine.control.CompositeCacheConfigurator parseElementAttributes
INFO: No special ElementAttribute class defined for key [jcs.region.testCache1.elementattributes], using default class.
Aug 16, 2018 8:53:10 AM org.apache.commons.jcs.engine.memory.AbstractDoubleLinkedListMemoryCache initialize
INFO: initialized MemoryCache for testCache1
Aug 16, 2018 8:53:10 AM org.apache.commons.jcs.engine.control.CompositeCache <init>
INFO: Constructed cache with name [testCache1] and cache attributes [ useLateral = true, useRemote = true, useDisk = true, maxObjs = 1000, maxSpoolPerRun = -1, diskUsagePattern = SWAP, spoolChunkSize = 2 ]
Aug 16, 2018 8:53:10 AM org.apache.commons.jcs.engine.control.CompositeCacheConfigurator parseRegions
INFO: Parsed regions [testCache1]
Aug 16, 2018 8:53:10 AM org.apache.commons.jcs.engine.control.CompositeCacheManager doConfigure
INFO: Finished configuration in 31 ms.
Tests run: 9, Failures: 0, Errors: 0, Skipped: 0, Time elapsed: 0.354 sec - in org.apache.torque.manager.AbstractBaseManagerTest
Running org.apache.torque.manager.MethodResultCacheTest
Aug 16, 2018 8:53:11 AM org.apache.commons.jcs.engine.control.CompositeCacheManager getInstance
INFO: Instance is null, creating with config [/cache.ccf]
Aug 16, 2018 8:53:11 AM org.apache.commons.jcs.engine.control.CompositeCacheManager configure
INFO: Creating cache manager from config file: /cache.ccf
Aug 16, 2018 8:53:11 AM org.apache.commons.jcs.utils.threadpool.ThreadPoolManager loadConfig
INFO: thread_pool.default PoolConfiguration = useBoundary = [false] boundarySize = [2000] maximumPoolSize = [150] minimumPoolSize = [4] keepAliveTime = [300000] whenBlockedPolicy = [RUN] startUpSize = [4]
Aug 16, 2018 8:53:11 AM org.apache.commons.jcs.engine.control.CompositeCacheManager doConfigure
INFO: Setting default auxiliaries to
Aug 16, 2018 8:53:11 AM org.apache.commons.jcs.engine.control.CompositeCacheManager doConfigure
INFO: setting defaultCompositeCacheAttributes to [ useLateral = true, useRemote = true, useDisk = true, maxObjs = 1000, maxSpoolPerRun = -1, diskUsagePattern = SWAP, spoolChunkSize = 2 ]
Aug 16, 2018 8:53:11 AM org.apache.commons.jcs.engine.control.CompositeCacheConfigurator parseElementAttributes
INFO: No special ElementAttribute class defined for key [jcs.default.elementattributes], using default class.
Aug 16, 2018 8:53:11 AM org.apache.commons.jcs.engine.control.CompositeCacheManager doConfigure
INFO: setting defaultElementAttributes to [ IS_LATERAL = true, IS_SPOOL = true, IS_REMOTE = true, IS_ETERNAL = true, MaxLifeSeconds = -1, IdleTime = -1, CreateTime = 1534409591357, LastAccessTime = 1534409591357, getTimeToLiveSeconds() = -1, createTime = 1534409591357 ]
Aug 16, 2018 8:53:11 AM org.apache.commons.jcs.engine.control.CompositeCacheConfigurator parseElementAttributes
INFO: No special ElementAttribute class defined for key [jcs.region.testCache1.elementattributes], using default class.
Aug 16, 2018 8:53:11 AM org.apache.commons.jcs.engine.memory.AbstractDoubleLinkedListMemoryCache initialize
INFO: initialized MemoryCache for testCache1
Aug 16, 2018 8:53:11 AM org.apache.commons.jcs.engine.control.CompositeCache <init>
INFO: Constructed cache with name [testCache1] and cache attributes [ useLateral = true, useRemote = true, useDisk = true, maxObjs = 1000, maxSpoolPerRun = -1, diskUsagePattern = SWAP, spoolChunkSize = 2 ]
Aug 16, 2018 8:53:11 AM org.apache.commons.jcs.engine.control.CompositeCacheConfigurator parseRegions
INFO: Parsed regions [testCache1]
Aug 16, 2018 8:53:11 AM org.apache.commons.jcs.engine.control.CompositeCacheManager doConfigure
INFO: Finished configuration in 35 ms.
Tests run: 3, Failures: 0, Errors: 0, Skipped: 0, Time elapsed: 0.325 sec - in org.apache.torque.manager.MethodResultCacheTest
Aug 16, 2018 8:53:11 AM org.apache.commons.jcs.engine.control.CompositeCacheManager run
INFO: Shutdown hook activated.  Shutdown was not called.  Shutting down JCS.
Running org.apache.torque.om.mapper.StringMapperTest
Tests run: 3, Failures: 0, Errors: 0, Skipped: 0, Time elapsed: 0.408 sec - in org.apache.torque.om.mapper.StringMapperTest
Running org.apache.torque.om.mapper.BigDecimalMapperTest
Tests run: 3, Failures: 0, Errors: 0, Skipped: 0, Time elapsed: 0.4 sec - in org.apache.torque.om.mapper.BigDecimalMapperTest
Running org.apache.torque.om.mapper.IntegerMapperTest
Tests run: 3, Failures: 0, Errors: 0, Skipped: 0, Time elapsed: 0.405 sec - in org.apache.torque.om.mapper.IntegerMapperTest
Running org.apache.torque.om.mapper.CompositeMapperTest
Tests run: 2, Failures: 0, Errors: 0, Skipped: 0, Time elapsed: 0.409 sec - in org.apache.torque.om.mapper.CompositeMapperTest
Running org.apache.torque.om.mapper.LongMapperTest
Tests run: 3, Failures: 0, Errors: 0, Skipped: 0, Time elapsed: 0.42 sec - in org.apache.torque.om.mapper.LongMapperTest
Running org.apache.torque.om.mapper.DateMapperTest
Tests run: 3, Failures: 0, Errors: 0, Skipped: 0, Time elapsed: 0.377 sec - in org.apache.torque.om.mapper.DateMapperTest
Running org.apache.torque.om.mapper.ObjectListMapperTest
Tests run: 12, Failures: 0, Errors: 0, Skipped: 0, Time elapsed: 0.523 sec - in org.apache.torque.om.mapper.ObjectListMapperTest
Running org.apache.torque.om.ComboKeyTest
Tests run: 9, Failures: 0, Errors: 0, Skipped: 0, Time elapsed: 0.043 sec - in org.apache.torque.om.ComboKeyTest
Running org.apache.torque.om.NumberKeyTest
Tests run: 23, Failures: 0, Errors: 0, Skipped: 0, Time elapsed: 0.045 sec - in org.apache.torque.om.NumberKeyTest
Running org.apache.torque.criteria.CriterionTest
Tests run: 10, Failures: 0, Errors: 0, Skipped: 0, Time elapsed: 0.208 sec - in org.apache.torque.criteria.CriterionTest
Running org.apache.torque.criteria.CriteriaTest
Tests run: 33, Failures: 0, Errors: 0, Skipped: 0, Time elapsed: 0.38 sec - in org.apache.torque.criteria.CriteriaTest
Running org.apache.torque.criteria.JoinTest
Tests run: 2, Failures: 0, Errors: 0, Skipped: 0, Time elapsed: 0.168 sec - in org.apache.torque.criteria.JoinTest
Running org.apache.torque.adapter.DBOracleTest
Tests run: 1, Failures: 0, Errors: 0, Skipped: 0, Time elapsed: 0.059 sec - in org.apache.torque.adapter.DBOracleTest
Running org.apache.torque.TorqueInstanceTest
Tests run: 5, Failures: 0, Errors: 0, Skipped: 0, Time elapsed: 0.165 sec - in org.apache.torque.TorqueInstanceTest

Results :

Tests run: 365, Failures: 0, Errors: 0, Skipped: 0

[JENKINS] Recording test results
[WARNING] Attempt to (de-)serialize anonymous class hudson.maven.reporters.SurefireArchiver$2; see: https://jenkins.io/redirect/serialization-of-anonymous-classes/
[WARNING] Attempt to (de-)serialize anonymous class hudson.maven.reporters.BuildInfoRecorder$1; see: https://jenkins.io/redirect/serialization-of-anonymous-classes/
[INFO]
[INFO] --- maven-jar-plugin:3.0.0:jar (default-jar) @ torque-runtime ---
[INFO] Building jar: <https://builds.apache.org/job/Torque4-trunk/org.apache.torque$torque-runtime/ws/target/torque-runtime-4.1-SNAPSHOT.jar>
[INFO]
[INFO] --- maven-site-plugin:3.5.1:attach-descriptor (attach-descriptor) @ torque-runtime ---
[INFO]
[INFO] --- maven-source-plugin:3.0.0:jar-no-fork (attach-sources) @ torque-runtime ---
[INFO] Building jar: <https://builds.apache.org/job/Torque4-trunk/org.apache.torque$torque-runtime/ws/target/torque-runtime-4.1-SNAPSHOT-sources.jar>
[INFO]
[INFO] --- apache-rat-plugin:0.11:check (default) @ torque-runtime ---
[INFO] 51 implicit excludes (use -debug for more details).
[INFO] Exclude: velocity.log
[INFO] Exclude: .checkstyle
[INFO] Exclude: checkstyle-cache.ccf
[INFO] Exclude: derby.log
[INFO] Exclude: LICENSE-EDL.txt
[INFO] Exclude: DEPENDENCIES
[INFO] Exclude: torque-test/target/**/*
[INFO] Exclude: torque-test/.classpath
[INFO] Exclude: torque-test/.project
[INFO] Exclude: torque-test/.settings/**
[INFO] Exclude: torque-test/src/main/generated-java/**/*
[INFO] Exclude: torque-test/derby.log
[INFO] 182 resources included (use -debug for more details)
[INFO] Rat check: Summary of files. Unapproved: 0 unknown: 0 generated: 0 approved: 180 licence.
[CHECKSTYLE] No report found for mojo check
[PMD] No report found for mojo check
[INFO]
[INFO] --- dependency-check-maven:3.1.2:check (default) @ torque-runtime ---
[INFO] Skipping dependency-check
[CHECKSTYLE] No report found for mojo check
[PMD] No report found for mojo check
[INFO]
[INFO] --- maven-install-plugin:2.5.2:install (default-install) @ torque-runtime ---
[INFO] Installing <https://builds.apache.org/job/Torque4-trunk/org.apache.torque$torque-runtime/ws/target/torque-runtime-4.1-SNAPSHOT.jar> to /home/jenkins/jenkins-slave/maven-repositories/0/org/apache/torque/torque-runtime/4.1-SNAPSHOT/torque-runtime-4.1-SNAPSHOT.jar
[INFO] Installing <https://builds.apache.org/job/Torque4-trunk/org.apache.torque$torque-runtime/ws/pom.xml> to /home/jenkins/jenkins-slave/maven-repositories/0/org/apache/torque/torque-runtime/4.1-SNAPSHOT/torque-runtime-4.1-SNAPSHOT.pom
[INFO] Installing <https://builds.apache.org/job/Torque4-trunk/org.apache.torque$torque-runtime/ws/target/torque-runtime-4.1-SNAPSHOT-sources.jar> to /home/jenkins/jenkins-slave/maven-repositories/0/org/apache/torque/torque-runtime/4.1-SNAPSHOT/torque-runtime-4.1-SNAPSHOT-sources.jar
[INFO]
[INFO] >>> cobertura-maven-plugin:2.3:cobertura (default-cli) > [cobertura]test @ torque-runtime >>>
[INFO]
[INFO] --- maven-remote-resources-plugin:1.5:process (process-resource-bundles) @ torque-runtime ---
[INFO]
[INFO] --- maven-resources-plugin:2.7:resources (default-resources) @ torque-runtime ---
[INFO] Using 'ISO-8859-1' encoding to copy filtered resources.
[INFO] skip non existing resourceDirectory <https://builds.apache.org/job/Torque4-trunk/org.apache.torque$torque-runtime/ws/src/main/resources>
[INFO] Copying 3 resources
[INFO] Copying 3 resources
[INFO]
[INFO] --- maven-compiler-plugin:3.5.1:compile (default-compile) @ torque-runtime ---
[INFO] Nothing to compile - all classes are up to date
[INFO]
[INFO] --- cobertura-maven-plugin:2.3:instrument (default-cli) @ torque-runtime ---
[INFO] Cobertura 1.9.2 - GNU GPL License (NO WARRANTY) - See COPYRIGHT file
Instrumenting 122 files to <https://builds.apache.org/job/Torque4-trunk/org.apache.torque$torque-runtime/ws/target/generated-classes/cobertura>
Cobertura: Saved information on 122 classes.
Instrument time: 475ms

[INFO] Instrumentation was successful.
[INFO]
[INFO] --- maven-resources-plugin:2.7:testResources (default-testResources) @ torque-runtime ---
[INFO] Using 'ISO-8859-1' encoding to copy filtered resources.
[INFO] Copying 5 resources
[INFO] Copying 3 resources
[INFO] Copying 3 resources
[INFO]
[INFO] --- maven-compiler-plugin:3.5.1:testCompile (default-testCompile) @ torque-runtime ---
[INFO] Nothing to compile - all classes are up to date
[INFO]
[INFO] --- maven-surefire-plugin:2.19.1:test (default-test) @ torque-runtime ---

-------------------------------------------------------
 T E S T S
-------------------------------------------------------

Results :

Tests run: 0, Failures: 0, Errors: 0, Skipped: 0

[JENKINS] Recording test results

---------------------------------------------------------------------
To unsubscribe, e-mail: [hidden email]
For additional commands, e-mail: [hidden email]

Reply | Threaded
Open this post in threaded view
|

Build failed in Jenkins: Torque4-trunk » Torque Runtime #581

Apache Jenkins Server-2
See <https://builds.apache.org/job/Torque4-trunk/org.apache.torque$torque-runtime/581/display/redirect?page=changes>

Changes:

[tv] Use try-with-resources where applicable
Replace StringBuffer with StringBuilder

------------------------------------------
[...truncated 4.10 KB...]
[INFO] Downloaded from central: https://repo.maven.apache.org/maven2/org/apache/avalon/framework/avalon-framework-api/4.3.1/avalon-framework-api-4.3.1.jar (33 kB at 1.7 MB/s)
[INFO] Downloading from central: https://repo.maven.apache.org/maven2/org/apache/avalon/framework/avalon-framework-impl/4.3.1/avalon-framework-impl-4.3.1.jar
[INFO] Downloaded from central: https://repo.maven.apache.org/maven2/org/apache/fulcrum/fulcrum-testcontainer/1.0.7/fulcrum-testcontainer-1.0.7.jar (16 kB at 819 kB/s)
[INFO] Downloading from central: https://repo.maven.apache.org/maven2/org/mockito/mockito-all/1.9.0/mockito-all-1.9.0.jar
[INFO] Downloaded from central: https://repo.maven.apache.org/maven2/junit/junit/4.8.1/junit-4.8.1.jar (237 kB at 6.8 MB/s)
[INFO] Downloaded from central: https://repo.maven.apache.org/maven2/org/apache/avalon/framework/avalon-framework-impl/4.3.1/avalon-framework-impl-4.3.1.jar (61 kB at 1.7 MB/s)
[INFO] Downloaded from central: https://repo.maven.apache.org/maven2/org/apache/fulcrum/fulcrum-yaafi/1.0.6/fulcrum-yaafi-1.0.6.jar (130 kB at 3.2 MB/s)
[INFO] Downloaded from central: https://repo.maven.apache.org/maven2/org/apache/commons/commons-jcs-core/2.2/commons-jcs-core-2.2.jar (535 kB at 9.9 MB/s)
[INFO] Downloaded from central: https://repo.maven.apache.org/maven2/org/mockito/mockito-all/1.9.0/mockito-all-1.9.0.jar (1.5 MB at 13 MB/s)
[INFO]
[INFO] --- maven-clean-plugin:3.0.0:clean (default-clean) @ torque-runtime ---
[INFO]
[INFO] --- maven-remote-resources-plugin:1.5:process (process-resource-bundles) @ torque-runtime ---
[INFO]
[INFO] --- maven-resources-plugin:2.7:resources (default-resources) @ torque-runtime ---
[INFO] Using 'ISO-8859-1' encoding to copy filtered resources.
[INFO] skip non existing resourceDirectory <https://builds.apache.org/job/Torque4-trunk/org.apache.torque$torque-runtime/ws/src/main/resources>
[INFO] Copying 3 resources
[INFO]
[INFO] --- maven-compiler-plugin:3.5.1:compile (default-compile) @ torque-runtime ---
[INFO] Changes detected - recompiling the module!
[INFO] Compiling 119 source files to <https://builds.apache.org/job/Torque4-trunk/org.apache.torque$torque-runtime/ws/target/classes>
[INFO]
[INFO] --- maven-resources-plugin:2.7:testResources (default-testResources) @ torque-runtime ---
[INFO] Using 'ISO-8859-1' encoding to copy filtered resources.
[INFO] Copying 5 resources
[INFO] Copying 3 resources
[INFO]
[INFO] --- maven-compiler-plugin:3.5.1:testCompile (default-testCompile) @ torque-runtime ---
[INFO] Changes detected - recompiling the module!
[INFO] Compiling 35 source files to <https://builds.apache.org/job/Torque4-trunk/org.apache.torque$torque-runtime/ws/target/test-classes>
[INFO]
[INFO] --- maven-surefire-plugin:2.19.1:test (default-test) @ torque-runtime ---
[WARNING] The parameter forkMode is deprecated since version 2.14. Use forkCount and reuseForks instead.

-------------------------------------------------------
 T E S T S
-------------------------------------------------------
Running org.apache.torque.avalon.AvalonTest
[WARNING] Unable to find any resource with the name '/componentConfiguration.properties'
[WARNING] Unable to find any resource with the name '/parameters.properties'
[INFO] YaffiContainer ready.
[INFO] YaffiContainer has been disposed.
[WARNING] Unable to find any resource with the name '/componentConfiguration.properties'
[WARNING] Unable to find any resource with the name '/parameters.properties'
[INFO] YaffiContainer ready.
[INFO] YaffiContainer has been disposed.
Tests run: 2, Failures: 0, Errors: 0, Skipped: 0, Time elapsed: 0.236 sec - in org.apache.torque.avalon.AvalonTest
Running org.apache.torque.sql.SqlBuilderTest
Tests run: 130, Failures: 0, Errors: 0, Skipped: 0, Time elapsed: 0.435 sec - in org.apache.torque.sql.SqlBuilderTest
Running org.apache.torque.sql.QueryTest
Tests run: 2, Failures: 0, Errors: 0, Skipped: 0, Time elapsed: 0.149 sec - in org.apache.torque.sql.QueryTest
Running org.apache.torque.TorqueRuntimeExceptionTest
Tests run: 1, Failures: 0, Errors: 0, Skipped: 0, Time elapsed: 0.134 sec - in org.apache.torque.TorqueRuntimeExceptionTest
Running org.apache.torque.map.ColumnMapTest
Tests run: 3, Failures: 0, Errors: 0, Skipped: 0, Time elapsed: 0.138 sec - in org.apache.torque.map.ColumnMapTest
Running org.apache.torque.TorqueInstanceTest
Tests run: 5, Failures: 0, Errors: 0, Skipped: 0, Time elapsed: 0.149 sec - in org.apache.torque.TorqueInstanceTest
Running org.apache.torque.om.mapper.DateMapperTest
Tests run: 3, Failures: 0, Errors: 0, Skipped: 0, Time elapsed: 0.376 sec - in org.apache.torque.om.mapper.DateMapperTest
Running org.apache.torque.om.mapper.StringMapperTest
Tests run: 3, Failures: 0, Errors: 0, Skipped: 0, Time elapsed: 0.395 sec - in org.apache.torque.om.mapper.StringMapperTest
Running org.apache.torque.om.mapper.BigDecimalMapperTest
Tests run: 3, Failures: 0, Errors: 0, Skipped: 0, Time elapsed: 0.394 sec - in org.apache.torque.om.mapper.BigDecimalMapperTest
Running org.apache.torque.om.mapper.LongMapperTest
Tests run: 3, Failures: 0, Errors: 0, Skipped: 0, Time elapsed: 0.397 sec - in org.apache.torque.om.mapper.LongMapperTest
Running org.apache.torque.om.mapper.IntegerMapperTest
Tests run: 3, Failures: 0, Errors: 0, Skipped: 0, Time elapsed: 0.371 sec - in org.apache.torque.om.mapper.IntegerMapperTest
Running org.apache.torque.om.mapper.ObjectListMapperTest
Tests run: 12, Failures: 0, Errors: 0, Skipped: 0, Time elapsed: 0.526 sec - in org.apache.torque.om.mapper.ObjectListMapperTest
Running org.apache.torque.om.mapper.CompositeMapperTest
Tests run: 2, Failures: 0, Errors: 0, Skipped: 0, Time elapsed: 0.374 sec - in org.apache.torque.om.mapper.CompositeMapperTest
Running org.apache.torque.om.ComboKeyTest
Tests run: 9, Failures: 0, Errors: 0, Skipped: 0, Time elapsed: 0.04 sec - in org.apache.torque.om.ComboKeyTest
Running org.apache.torque.om.NumberKeyTest
Tests run: 23, Failures: 0, Errors: 0, Skipped: 0, Time elapsed: 0.045 sec - in org.apache.torque.om.NumberKeyTest
Running org.apache.torque.util.UniqueListTest
Tests run: 2, Failures: 0, Errors: 0, Skipped: 0, Time elapsed: 0.027 sec - in org.apache.torque.util.UniqueListTest
Running org.apache.torque.util.BasePeerImplTest
Tests run: 16, Failures: 0, Errors: 0, Skipped: 0, Time elapsed: 0.552 sec - in org.apache.torque.util.BasePeerImplTest
Running org.apache.torque.util.SummaryHelperTest
Tests run: 1, Failures: 0, Errors: 0, Skipped: 0, Time elapsed: 0.47 sec - in org.apache.torque.util.SummaryHelperTest
Running org.apache.torque.util.functions.MinTest
Tests run: 4, Failures: 0, Errors: 0, Skipped: 0, Time elapsed: 0.034 sec - in org.apache.torque.util.functions.MinTest
Running org.apache.torque.util.functions.AvgTest
Tests run: 4, Failures: 0, Errors: 0, Skipped: 0, Time elapsed: 0.034 sec - in org.apache.torque.util.functions.AvgTest
Running org.apache.torque.util.functions.MaxTest
Tests run: 4, Failures: 0, Errors: 0, Skipped: 0, Time elapsed: 0.035 sec - in org.apache.torque.util.functions.MaxTest
Running org.apache.torque.util.functions.CountTest
Tests run: 4, Failures: 0, Errors: 0, Skipped: 0, Time elapsed: 0.035 sec - in org.apache.torque.util.functions.CountTest
Running org.apache.torque.util.functions.SumTest
Tests run: 4, Failures: 0, Errors: 0, Skipped: 0, Time elapsed: 0.035 sec - in org.apache.torque.util.functions.SumTest
Running org.apache.torque.util.functions.AggregateFunctionTest
Tests run: 12, Failures: 0, Errors: 0, Skipped: 0, Time elapsed: 0.035 sec - in org.apache.torque.util.functions.AggregateFunctionTest
Running org.apache.torque.util.functions.AbstractFunctionTest
Tests run: 11, Failures: 0, Errors: 0, Skipped: 0, Time elapsed: 0.042 sec - in org.apache.torque.util.functions.AbstractFunctionTest
Running org.apache.torque.criteria.CriteriaTest
Tests run: 33, Failures: 0, Errors: 0, Skipped: 0, Time elapsed: 0.356 sec - in org.apache.torque.criteria.CriteriaTest
Running org.apache.torque.criteria.JoinTest
Tests run: 2, Failures: 0, Errors: 0, Skipped: 0, Time elapsed: 0.149 sec - in org.apache.torque.criteria.JoinTest
Running org.apache.torque.criteria.CriterionTest
Tests run: 10, Failures: 0, Errors: 0, Skipped: 0, Time elapsed: 0.153 sec - in org.apache.torque.criteria.CriterionTest
Running org.apache.torque.ColumnImplTest
Tests run: 41, Failures: 0, Errors: 0, Skipped: 0, Time elapsed: 0.225 sec - in org.apache.torque.ColumnImplTest
Running org.apache.torque.adapter.DBOracleTest
Tests run: 1, Failures: 0, Errors: 0, Skipped: 0, Time elapsed: 0.045 sec - in org.apache.torque.adapter.DBOracleTest
Running org.apache.torque.manager.MethodResultCacheTest
Aug 16, 2018 9:33:38 AM org.apache.commons.jcs.engine.control.CompositeCacheManager getInstance
INFO: Instance is null, creating with config [/cache.ccf]
Aug 16, 2018 9:33:38 AM org.apache.commons.jcs.engine.control.CompositeCacheManager configure
INFO: Creating cache manager from config file: /cache.ccf
Aug 16, 2018 9:33:38 AM org.apache.commons.jcs.utils.threadpool.ThreadPoolManager loadConfig
INFO: thread_pool.default PoolConfiguration = useBoundary = [false] boundarySize = [2000] maximumPoolSize = [150] minimumPoolSize = [4] keepAliveTime = [300000] whenBlockedPolicy = [RUN] startUpSize = [4]
Aug 16, 2018 9:33:38 AM org.apache.commons.jcs.engine.control.CompositeCacheManager doConfigure
INFO: Setting default auxiliaries to
Aug 16, 2018 9:33:38 AM org.apache.commons.jcs.engine.control.CompositeCacheManager doConfigure
INFO: setting defaultCompositeCacheAttributes to [ useLateral = true, useRemote = true, useDisk = true, maxObjs = 1000, maxSpoolPerRun = -1, diskUsagePattern = SWAP, spoolChunkSize = 2 ]
Aug 16, 2018 9:33:38 AM org.apache.commons.jcs.engine.control.CompositeCacheConfigurator parseElementAttributes
INFO: No special ElementAttribute class defined for key [jcs.default.elementattributes], using default class.
Aug 16, 2018 9:33:38 AM org.apache.commons.jcs.engine.control.CompositeCacheManager doConfigure
INFO: setting defaultElementAttributes to [ IS_LATERAL = true, IS_SPOOL = true, IS_REMOTE = true, IS_ETERNAL = true, MaxLifeSeconds = -1, IdleTime = -1, CreateTime = 1534412018259, LastAccessTime = 1534412018259, getTimeToLiveSeconds() = -1, createTime = 1534412018259 ]
Aug 16, 2018 9:33:38 AM org.apache.commons.jcs.engine.control.CompositeCacheConfigurator parseElementAttributes
INFO: No special ElementAttribute class defined for key [jcs.region.testCache1.elementattributes], using default class.
Aug 16, 2018 9:33:38 AM org.apache.commons.jcs.engine.memory.AbstractDoubleLinkedListMemoryCache initialize
INFO: initialized MemoryCache for testCache1
Aug 16, 2018 9:33:38 AM org.apache.commons.jcs.engine.control.CompositeCache <init>
INFO: Constructed cache with name [testCache1] and cache attributes [ useLateral = true, useRemote = true, useDisk = true, maxObjs = 1000, maxSpoolPerRun = -1, diskUsagePattern = SWAP, spoolChunkSize = 2 ]
Aug 16, 2018 9:33:38 AM org.apache.commons.jcs.engine.control.CompositeCacheConfigurator parseRegions
INFO: Parsed regions [testCache1]
Aug 16, 2018 9:33:38 AM org.apache.commons.jcs.engine.control.CompositeCacheManager doConfigure
INFO: Finished configuration in 40 ms.
Tests run: 3, Failures: 0, Errors: 0, Skipped: 0, Time elapsed: 0.323 sec - in org.apache.torque.manager.MethodResultCacheTest
Aug 16, 2018 9:33:38 AM org.apache.commons.jcs.engine.control.CompositeCacheManager run
INFO: Shutdown hook activated.  Shutdown was not called.  Shutting down JCS.
Running org.apache.torque.manager.AbstractBaseManagerTest
Aug 16, 2018 9:33:38 AM org.apache.commons.jcs.engine.control.CompositeCacheManager getInstance
INFO: Instance is null, creating with config [/cache.ccf]
Aug 16, 2018 9:33:39 AM org.apache.commons.jcs.engine.control.CompositeCacheManager configure
INFO: Creating cache manager from config file: /cache.ccf
Aug 16, 2018 9:33:39 AM org.apache.commons.jcs.utils.threadpool.ThreadPoolManager loadConfig
INFO: thread_pool.default PoolConfiguration = useBoundary = [false] boundarySize = [2000] maximumPoolSize = [150] minimumPoolSize = [4] keepAliveTime = [300000] whenBlockedPolicy = [RUN] startUpSize = [4]
Aug 16, 2018 9:33:39 AM org.apache.commons.jcs.engine.control.CompositeCacheManager doConfigure
INFO: Setting default auxiliaries to
Aug 16, 2018 9:33:39 AM org.apache.commons.jcs.engine.control.CompositeCacheManager doConfigure
INFO: setting defaultCompositeCacheAttributes to [ useLateral = true, useRemote = true, useDisk = true, maxObjs = 1000, maxSpoolPerRun = -1, diskUsagePattern = SWAP, spoolChunkSize = 2 ]
Aug 16, 2018 9:33:39 AM org.apache.commons.jcs.engine.control.CompositeCacheConfigurator parseElementAttributes
INFO: No special ElementAttribute class defined for key [jcs.default.elementattributes], using default class.
Aug 16, 2018 9:33:39 AM org.apache.commons.jcs.engine.control.CompositeCacheManager doConfigure
INFO: setting defaultElementAttributes to [ IS_LATERAL = true, IS_SPOOL = true, IS_REMOTE = true, IS_ETERNAL = true, MaxLifeSeconds = -1, IdleTime = -1, CreateTime = 1534412019122, LastAccessTime = 1534412019122, getTimeToLiveSeconds() = -1, createTime = 1534412019122 ]
Aug 16, 2018 9:33:39 AM org.apache.commons.jcs.engine.control.CompositeCacheConfigurator parseElementAttributes
INFO: No special ElementAttribute class defined for key [jcs.region.testCache1.elementattributes], using default class.
Aug 16, 2018 9:33:39 AM org.apache.commons.jcs.engine.memory.AbstractDoubleLinkedListMemoryCache initialize
INFO: initialized MemoryCache for testCache1
Aug 16, 2018 9:33:39 AM org.apache.commons.jcs.engine.control.CompositeCache <init>
INFO: Constructed cache with name [testCache1] and cache attributes [ useLateral = true, useRemote = true, useDisk = true, maxObjs = 1000, maxSpoolPerRun = -1, diskUsagePattern = SWAP, spoolChunkSize = 2 ]
Aug 16, 2018 9:33:39 AM org.apache.commons.jcs.engine.control.CompositeCacheConfigurator parseRegions
INFO: Parsed regions [testCache1]
Aug 16, 2018 9:33:39 AM org.apache.commons.jcs.engine.control.CompositeCacheManager doConfigure
INFO: Finished configuration in 40 ms.
Tests run: 9, Failures: 0, Errors: 0, Skipped: 0, Time elapsed: 0.326 sec - in org.apache.torque.manager.AbstractBaseManagerTest
Aug 16, 2018 9:33:39 AM org.apache.commons.jcs.engine.control.CompositeCacheManager run
INFO: Shutdown hook activated.  Shutdown was not called.  Shutting down JCS.

Results :

Tests run: 365, Failures: 0, Errors: 0, Skipped: 0

[JENKINS] Recording test results
[WARNING] Attempt to (de-)serialize anonymous class hudson.maven.reporters.SurefireArchiver$2; see: https://jenkins.io/redirect/serialization-of-anonymous-classes/
[WARNING] Attempt to (de-)serialize anonymous class hudson.maven.reporters.BuildInfoRecorder$1; see: https://jenkins.io/redirect/serialization-of-anonymous-classes/
[INFO]
[INFO] --- maven-jar-plugin:3.0.0:jar (default-jar) @ torque-runtime ---
[INFO] Building jar: <https://builds.apache.org/job/Torque4-trunk/org.apache.torque$torque-runtime/ws/target/torque-runtime-4.1-SNAPSHOT.jar>
[INFO]
[INFO] --- maven-site-plugin:3.5.1:attach-descriptor (attach-descriptor) @ torque-runtime ---
[INFO]
[INFO] --- maven-source-plugin:3.0.0:jar-no-fork (attach-sources) @ torque-runtime ---
[INFO] Building jar: <https://builds.apache.org/job/Torque4-trunk/org.apache.torque$torque-runtime/ws/target/torque-runtime-4.1-SNAPSHOT-sources.jar>
[INFO]
[INFO] --- apache-rat-plugin:0.11:check (default) @ torque-runtime ---
[INFO] 51 implicit excludes (use -debug for more details).
[INFO] Exclude: velocity.log
[INFO] Exclude: .checkstyle
[INFO] Exclude: checkstyle-cache.ccf
[INFO] Exclude: derby.log
[INFO] Exclude: LICENSE-EDL.txt
[INFO] Exclude: DEPENDENCIES
[INFO] Exclude: torque-test/target/**/*
[INFO] Exclude: torque-test/.classpath
[INFO] Exclude: torque-test/.project
[INFO] Exclude: torque-test/.settings/**
[INFO] Exclude: torque-test/src/main/generated-java/**/*
[INFO] Exclude: torque-test/derby.log
[INFO] 182 resources included (use -debug for more details)
[INFO] Rat check: Summary of files. Unapproved: 0 unknown: 0 generated: 0 approved: 180 licence.
[CHECKSTYLE] No report found for mojo check
[PMD] No report found for mojo check
[INFO]
[INFO] --- dependency-check-maven:3.1.2:check (default) @ torque-runtime ---
[INFO] Skipping dependency-check
[CHECKSTYLE] No report found for mojo check
[PMD] No report found for mojo check
[INFO]
[INFO] --- maven-install-plugin:2.5.2:install (default-install) @ torque-runtime ---
[INFO] Installing <https://builds.apache.org/job/Torque4-trunk/org.apache.torque$torque-runtime/ws/target/torque-runtime-4.1-SNAPSHOT.jar> to /home/jenkins/jenkins-slave/maven-repositories/1/org/apache/torque/torque-runtime/4.1-SNAPSHOT/torque-runtime-4.1-SNAPSHOT.jar
[INFO] Installing <https://builds.apache.org/job/Torque4-trunk/org.apache.torque$torque-runtime/ws/pom.xml> to /home/jenkins/jenkins-slave/maven-repositories/1/org/apache/torque/torque-runtime/4.1-SNAPSHOT/torque-runtime-4.1-SNAPSHOT.pom
[INFO] Installing <https://builds.apache.org/job/Torque4-trunk/org.apache.torque$torque-runtime/ws/target/torque-runtime-4.1-SNAPSHOT-sources.jar> to /home/jenkins/jenkins-slave/maven-repositories/1/org/apache/torque/torque-runtime/4.1-SNAPSHOT/torque-runtime-4.1-SNAPSHOT-sources.jar
[INFO]
[INFO] >>> cobertura-maven-plugin:2.3:cobertura (default-cli) > [cobertura]test @ torque-runtime >>>
[INFO]
[INFO] --- maven-remote-resources-plugin:1.5:process (process-resource-bundles) @ torque-runtime ---
[INFO]
[INFO] --- maven-resources-plugin:2.7:resources (default-resources) @ torque-runtime ---
[INFO] Using 'ISO-8859-1' encoding to copy filtered resources.
[INFO] skip non existing resourceDirectory <https://builds.apache.org/job/Torque4-trunk/org.apache.torque$torque-runtime/ws/src/main/resources>
[INFO] Copying 3 resources
[INFO] Copying 3 resources
[INFO]
[INFO] --- maven-compiler-plugin:3.5.1:compile (default-compile) @ torque-runtime ---
[INFO] Nothing to compile - all classes are up to date
[INFO]
[INFO] --- cobertura-maven-plugin:2.3:instrument (default-cli) @ torque-runtime ---
[INFO] Cobertura 1.9.2 - GNU GPL License (NO WARRANTY) - See COPYRIGHT file
Instrumenting 122 files to <https://builds.apache.org/job/Torque4-trunk/org.apache.torque$torque-runtime/ws/target/generated-classes/cobertura>
Cobertura: Saved information on 122 classes.
Instrument time: 471ms

[INFO] Instrumentation was successful.
[INFO]
[INFO] --- maven-resources-plugin:2.7:testResources (default-testResources) @ torque-runtime ---
[INFO] Using 'ISO-8859-1' encoding to copy filtered resources.
[INFO] Copying 5 resources
[INFO] Copying 3 resources
[INFO] Copying 3 resources
[INFO]
[INFO] --- maven-compiler-plugin:3.5.1:testCompile (default-testCompile) @ torque-runtime ---
[INFO] Nothing to compile - all classes are up to date
[INFO]
[INFO] --- maven-surefire-plugin:2.19.1:test (default-test) @ torque-runtime ---

-------------------------------------------------------
 T E S T S
-------------------------------------------------------

Results :

Tests run: 0, Failures: 0, Errors: 0, Skipped: 0

[JENKINS] Recording test results

---------------------------------------------------------------------
To unsubscribe, e-mail: [hidden email]
For additional commands, e-mail: [hidden email]

Reply | Threaded
Open this post in threaded view
|

Build failed in Jenkins: Torque4-trunk » Torque Runtime #582

Apache Jenkins Server-2
See <https://builds.apache.org/job/Torque4-trunk/org.apache.torque$torque-runtime/582/display/redirect?page=changes>

Changes:

[tv] Cleanup

------------------------------------------
[...truncated 3.20 KB...]
[INFO] Downloading from central: https://repo.maven.apache.org/maven2/junit/junit/4.8.1/junit-4.8.1.jar
[INFO] Downloading from central: https://repo.maven.apache.org/maven2/org/apache/fulcrum/fulcrum-testcontainer/1.0.7/fulcrum-testcontainer-1.0.7.jar
[INFO] Downloaded from central: https://repo.maven.apache.org/maven2/org/apache/fulcrum/fulcrum-testcontainer/1.0.7/fulcrum-testcontainer-1.0.7.jar (16 kB at 862 kB/s)
[INFO] Downloading from central: https://repo.maven.apache.org/maven2/org/apache/fulcrum/fulcrum-yaafi/1.0.6/fulcrum-yaafi-1.0.6.jar
[INFO] Downloaded from central: https://repo.maven.apache.org/maven2/org/apache/commons/commons-pool2/2.6.0/commons-pool2-2.6.0.jar (131 kB at 4.1 MB/s)
[INFO] Downloaded from central: https://repo.maven.apache.org/maven2/org/apache/commons/commons-dbcp2/2.5.0/commons-dbcp2-2.5.0.jar (197 kB at 6.2 MB/s)
[INFO] Downloading from central: https://repo.maven.apache.org/maven2/org/mockito/mockito-all/1.9.0/mockito-all-1.9.0.jar
[INFO] Downloaded from central: https://repo.maven.apache.org/maven2/junit/junit/4.8.1/junit-4.8.1.jar (237 kB at 6.8 MB/s)
[INFO] Downloaded from central: https://repo.maven.apache.org/maven2/org/apache/fulcrum/fulcrum-yaafi/1.0.6/fulcrum-yaafi-1.0.6.jar (130 kB at 2.6 MB/s)
[INFO] Downloaded from central: https://repo.maven.apache.org/maven2/org/apache/commons/commons-jcs-core/2.2/commons-jcs-core-2.2.jar (535 kB at 8.5 MB/s)
[INFO] Downloaded from central: https://repo.maven.apache.org/maven2/org/mockito/mockito-all/1.9.0/mockito-all-1.9.0.jar (1.5 MB at 12 MB/s)
[INFO]
[INFO] --- maven-clean-plugin:3.0.0:clean (default-clean) @ torque-runtime ---
[INFO]
[INFO] --- maven-remote-resources-plugin:1.5:process (process-resource-bundles) @ torque-runtime ---
[INFO]
[INFO] --- maven-resources-plugin:2.7:resources (default-resources) @ torque-runtime ---
[INFO] Using 'ISO-8859-1' encoding to copy filtered resources.
[INFO] skip non existing resourceDirectory <https://builds.apache.org/job/Torque4-trunk/org.apache.torque$torque-runtime/ws/src/main/resources>
[INFO] Copying 3 resources
[INFO]
[INFO] --- maven-compiler-plugin:3.5.1:compile (default-compile) @ torque-runtime ---
[INFO] Changes detected - recompiling the module!
[INFO] Compiling 119 source files to <https://builds.apache.org/job/Torque4-trunk/org.apache.torque$torque-runtime/ws/target/classes>
[INFO]
[INFO] --- maven-resources-plugin:2.7:testResources (default-testResources) @ torque-runtime ---
[INFO] Using 'ISO-8859-1' encoding to copy filtered resources.
[INFO] Copying 5 resources
[INFO] Copying 3 resources
[INFO]
[INFO] --- maven-compiler-plugin:3.5.1:testCompile (default-testCompile) @ torque-runtime ---
[INFO] Changes detected - recompiling the module!
[INFO] Compiling 35 source files to <https://builds.apache.org/job/Torque4-trunk/org.apache.torque$torque-runtime/ws/target/test-classes>
[INFO]
[INFO] --- maven-surefire-plugin:2.19.1:test (default-test) @ torque-runtime ---
[WARNING] The parameter forkMode is deprecated since version 2.14. Use forkCount and reuseForks instead.

-------------------------------------------------------
 T E S T S
-------------------------------------------------------
Running org.apache.torque.ColumnImplTest
Tests run: 41, Failures: 0, Errors: 0, Skipped: 0, Time elapsed: 0.318 sec - in org.apache.torque.ColumnImplTest
Running org.apache.torque.TorqueInstanceTest
Tests run: 5, Failures: 0, Errors: 0, Skipped: 0, Time elapsed: 0.245 sec - in org.apache.torque.TorqueInstanceTest
Running org.apache.torque.map.ColumnMapTest
Tests run: 3, Failures: 0, Errors: 0, Skipped: 0, Time elapsed: 0.199 sec - in org.apache.torque.map.ColumnMapTest
Running org.apache.torque.TorqueRuntimeExceptionTest
Tests run: 1, Failures: 0, Errors: 0, Skipped: 0, Time elapsed: 0.218 sec - in org.apache.torque.TorqueRuntimeExceptionTest
Running org.apache.torque.util.functions.AbstractFunctionTest
Tests run: 11, Failures: 0, Errors: 0, Skipped: 0, Time elapsed: 0.061 sec - in org.apache.torque.util.functions.AbstractFunctionTest
Running org.apache.torque.util.functions.AggregateFunctionTest
Tests run: 12, Failures: 0, Errors: 0, Skipped: 0, Time elapsed: 0.048 sec - in org.apache.torque.util.functions.AggregateFunctionTest
Running org.apache.torque.util.functions.MaxTest
Tests run: 4, Failures: 0, Errors: 0, Skipped: 0, Time elapsed: 0.043 sec - in org.apache.torque.util.functions.MaxTest
Running org.apache.torque.util.functions.MinTest
Tests run: 4, Failures: 0, Errors: 0, Skipped: 0, Time elapsed: 0.059 sec - in org.apache.torque.util.functions.MinTest
Running org.apache.torque.util.functions.AvgTest
Tests run: 4, Failures: 0, Errors: 0, Skipped: 0, Time elapsed: 0.044 sec - in org.apache.torque.util.functions.AvgTest
Running org.apache.torque.util.functions.SumTest
Tests run: 4, Failures: 0, Errors: 0, Skipped: 0, Time elapsed: 0.057 sec - in org.apache.torque.util.functions.SumTest
Running org.apache.torque.util.functions.CountTest
Tests run: 4, Failures: 0, Errors: 0, Skipped: 0, Time elapsed: 0.037 sec - in org.apache.torque.util.functions.CountTest
Running org.apache.torque.util.SummaryHelperTest
Tests run: 1, Failures: 0, Errors: 0, Skipped: 0, Time elapsed: 0.631 sec - in org.apache.torque.util.SummaryHelperTest
Running org.apache.torque.util.BasePeerImplTest
Tests run: 16, Failures: 0, Errors: 0, Skipped: 0, Time elapsed: 0.747 sec - in org.apache.torque.util.BasePeerImplTest
Running org.apache.torque.util.UniqueListTest
Tests run: 2, Failures: 0, Errors: 0, Skipped: 0, Time elapsed: 0.034 sec - in org.apache.torque.util.UniqueListTest
Running org.apache.torque.om.NumberKeyTest
Tests run: 23, Failures: 0, Errors: 0, Skipped: 0, Time elapsed: 0.073 sec - in org.apache.torque.om.NumberKeyTest
Running org.apache.torque.om.ComboKeyTest
Tests run: 9, Failures: 0, Errors: 0, Skipped: 0, Time elapsed: 0.06 sec - in org.apache.torque.om.ComboKeyTest
Running org.apache.torque.om.mapper.IntegerMapperTest
Tests run: 3, Failures: 0, Errors: 0, Skipped: 0, Time elapsed: 0.489 sec - in org.apache.torque.om.mapper.IntegerMapperTest
Running org.apache.torque.om.mapper.CompositeMapperTest
Tests run: 2, Failures: 0, Errors: 0, Skipped: 0, Time elapsed: 0.5 sec - in org.apache.torque.om.mapper.CompositeMapperTest
Running org.apache.torque.om.mapper.DateMapperTest
Tests run: 3, Failures: 0, Errors: 0, Skipped: 0, Time elapsed: 0.599 sec - in org.apache.torque.om.mapper.DateMapperTest
Running org.apache.torque.om.mapper.BigDecimalMapperTest
Tests run: 3, Failures: 0, Errors: 0, Skipped: 0, Time elapsed: 0.592 sec - in org.apache.torque.om.mapper.BigDecimalMapperTest
Running org.apache.torque.om.mapper.StringMapperTest
Tests run: 3, Failures: 0, Errors: 0, Skipped: 0, Time elapsed: 0.508 sec - in org.apache.torque.om.mapper.StringMapperTest
Running org.apache.torque.om.mapper.LongMapperTest
Tests run: 3, Failures: 0, Errors: 0, Skipped: 0, Time elapsed: 0.486 sec - in org.apache.torque.om.mapper.LongMapperTest
Running org.apache.torque.om.mapper.ObjectListMapperTest
Tests run: 12, Failures: 0, Errors: 0, Skipped: 0, Time elapsed: 0.701 sec - in org.apache.torque.om.mapper.ObjectListMapperTest
Running org.apache.torque.sql.SqlBuilderTest
Tests run: 130, Failures: 0, Errors: 0, Skipped: 0, Time elapsed: 0.561 sec - in org.apache.torque.sql.SqlBuilderTest
Running org.apache.torque.sql.QueryTest
Tests run: 2, Failures: 0, Errors: 0, Skipped: 0, Time elapsed: 0.225 sec - in org.apache.torque.sql.QueryTest
Running org.apache.torque.criteria.CriteriaTest
Tests run: 33, Failures: 0, Errors: 0, Skipped: 0, Time elapsed: 0.531 sec - in org.apache.torque.criteria.CriteriaTest
Running org.apache.torque.criteria.JoinTest
Tests run: 2, Failures: 0, Errors: 0, Skipped: 0, Time elapsed: 0.212 sec - in org.apache.torque.criteria.JoinTest
Running org.apache.torque.criteria.CriterionTest
Tests run: 10, Failures: 0, Errors: 0, Skipped: 0, Time elapsed: 0.231 sec - in org.apache.torque.criteria.CriterionTest
Running org.apache.torque.adapter.DBOracleTest
Tests run: 1, Failures: 0, Errors: 0, Skipped: 0, Time elapsed: 0.04 sec - in org.apache.torque.adapter.DBOracleTest
Running org.apache.torque.avalon.AvalonTest
[WARNING] Unable to find any resource with the name '/componentConfiguration.properties'
[WARNING] Unable to find any resource with the name '/parameters.properties'
[INFO] YaffiContainer ready.
[INFO] YaffiContainer has been disposed.
[WARNING] Unable to find any resource with the name '/componentConfiguration.properties'
[WARNING] Unable to find any resource with the name '/parameters.properties'
[INFO] YaffiContainer ready.
[INFO] YaffiContainer has been disposed.
Tests run: 2, Failures: 0, Errors: 0, Skipped: 0, Time elapsed: 0.345 sec - in org.apache.torque.avalon.AvalonTest
Running org.apache.torque.manager.AbstractBaseManagerTest
Aug 16, 2018 11:13:32 AM org.apache.commons.jcs.engine.control.CompositeCacheManager getInstance
INFO: Instance is null, creating with config [/cache.ccf]
Aug 16, 2018 11:13:32 AM org.apache.commons.jcs.engine.control.CompositeCacheManager configure
INFO: Creating cache manager from config file: /cache.ccf
Aug 16, 2018 11:13:32 AM org.apache.commons.jcs.utils.threadpool.ThreadPoolManager loadConfig
INFO: thread_pool.default PoolConfiguration = useBoundary = [false] boundarySize = [2000] maximumPoolSize = [150] minimumPoolSize = [4] keepAliveTime = [300000] whenBlockedPolicy = [RUN] startUpSize = [4]
Aug 16, 2018 11:13:32 AM org.apache.commons.jcs.engine.control.CompositeCacheManager doConfigure
INFO: Setting default auxiliaries to
Aug 16, 2018 11:13:32 AM org.apache.commons.jcs.engine.control.CompositeCacheManager doConfigure
INFO: setting defaultCompositeCacheAttributes to [ useLateral = true, useRemote = true, useDisk = true, maxObjs = 1000, maxSpoolPerRun = -1, diskUsagePattern = SWAP, spoolChunkSize = 2 ]
Aug 16, 2018 11:13:32 AM org.apache.commons.jcs.engine.control.CompositeCacheConfigurator parseElementAttributes
INFO: No special ElementAttribute class defined for key [jcs.default.elementattributes], using default class.
Aug 16, 2018 11:13:32 AM org.apache.commons.jcs.engine.control.CompositeCacheManager doConfigure
INFO: setting defaultElementAttributes to [ IS_LATERAL = true, IS_SPOOL = true, IS_REMOTE = true, IS_ETERNAL = true, MaxLifeSeconds = -1, IdleTime = -1, CreateTime = 1534418012214, LastAccessTime = 1534418012214, getTimeToLiveSeconds() = -1, createTime = 1534418012214 ]
Aug 16, 2018 11:13:32 AM org.apache.commons.jcs.engine.control.CompositeCacheConfigurator parseElementAttributes
INFO: No special ElementAttribute class defined for key [jcs.region.testCache1.elementattributes], using default class.
Aug 16, 2018 11:13:32 AM org.apache.commons.jcs.engine.memory.AbstractDoubleLinkedListMemoryCache initialize
INFO: initialized MemoryCache for testCache1
Aug 16, 2018 11:13:32 AM org.apache.commons.jcs.engine.control.CompositeCache <init>
INFO: Constructed cache with name [testCache1] and cache attributes [ useLateral = true, useRemote = true, useDisk = true, maxObjs = 1000, maxSpoolPerRun = -1, diskUsagePattern = SWAP, spoolChunkSize = 2 ]
Aug 16, 2018 11:13:32 AM org.apache.commons.jcs.engine.control.CompositeCacheConfigurator parseRegions
INFO: Parsed regions [testCache1]
Aug 16, 2018 11:13:32 AM org.apache.commons.jcs.engine.control.CompositeCacheManager doConfigure
INFO: Finished configuration in 60 ms.
Tests run: 9, Failures: 0, Errors: 0, Skipped: 0, Time elapsed: 0.483 sec - in org.apache.torque.manager.AbstractBaseManagerTest
Running org.apache.torque.manager.MethodResultCacheTest
Aug 16, 2018 11:13:33 AM org.apache.commons.jcs.engine.control.CompositeCacheManager getInstance
INFO: Instance is null, creating with config [/cache.ccf]
Aug 16, 2018 11:13:33 AM org.apache.commons.jcs.engine.control.CompositeCacheManager configure
INFO: Creating cache manager from config file: /cache.ccf
Aug 16, 2018 11:13:33 AM org.apache.commons.jcs.utils.threadpool.ThreadPoolManager loadConfig
INFO: thread_pool.default PoolConfiguration = useBoundary = [false] boundarySize = [2000] maximumPoolSize = [150] minimumPoolSize = [4] keepAliveTime = [300000] whenBlockedPolicy = [RUN] startUpSize = [4]
Aug 16, 2018 11:13:33 AM org.apache.commons.jcs.engine.control.CompositeCacheManager doConfigure
INFO: Setting default auxiliaries to
Aug 16, 2018 11:13:33 AM org.apache.commons.jcs.engine.control.CompositeCacheManager doConfigure
INFO: setting defaultCompositeCacheAttributes to [ useLateral = true, useRemote = true, useDisk = true, maxObjs = 1000, maxSpoolPerRun = -1, diskUsagePattern = SWAP, spoolChunkSize = 2 ]
Aug 16, 2018 11:13:33 AM org.apache.commons.jcs.engine.control.CompositeCacheConfigurator parseElementAttributes
INFO: No special ElementAttribute class defined for key [jcs.default.elementattributes], using default class.
Aug 16, 2018 11:13:33 AM org.apache.commons.jcs.engine.control.CompositeCacheManager doConfigure
INFO: setting defaultElementAttributes to [ IS_LATERAL = true, IS_SPOOL = true, IS_REMOTE = true, IS_ETERNAL = true, MaxLifeSeconds = -1, IdleTime = -1, CreateTime = 1534418013327, LastAccessTime = 1534418013327, getTimeToLiveSeconds() = -1, createTime = 1534418013327 ]
Aug 16, 2018 11:13:33 AM org.apache.commons.jcs.engine.control.CompositeCacheConfigurator parseElementAttributes
INFO: No special ElementAttribute class defined for key [jcs.region.testCache1.elementattributes], using default class.
Aug 16, 2018 11:13:33 AM org.apache.commons.jcs.engine.memory.AbstractDoubleLinkedListMemoryCache initialize
INFO: initialized MemoryCache for testCache1
Aug 16, 2018 11:13:33 AM org.apache.commons.jcs.engine.control.CompositeCache <init>
INFO: Constructed cache with name [testCache1] and cache attributes [ useLateral = true, useRemote = true, useDisk = true, maxObjs = 1000, maxSpoolPerRun = -1, diskUsagePattern = SWAP, spoolChunkSize = 2 ]
Aug 16, 2018 11:13:33 AM org.apache.commons.jcs.engine.control.CompositeCacheConfigurator parseRegions
INFO: Parsed regions [testCache1]
Aug 16, 2018 11:13:33 AM org.apache.commons.jcs.engine.control.CompositeCacheManager doConfigure
INFO: Finished configuration in 52 ms.
Tests run: 3, Failures: 0, Errors: 0, Skipped: 0, Time elapsed: 0.45 sec - in org.apache.torque.manager.MethodResultCacheTest
Aug 16, 2018 11:13:33 AM org.apache.commons.jcs.engine.control.CompositeCacheManager run
INFO: Shutdown hook activated.  Shutdown was not called.  Shutting down JCS.

Results :

Tests run: 365, Failures: 0, Errors: 0, Skipped: 0

[JENKINS] Recording test results
[WARNING] Attempt to (de-)serialize anonymous class hudson.maven.reporters.SurefireArchiver$2; see: https://jenkins.io/redirect/serialization-of-anonymous-classes/
[WARNING] Attempt to (de-)serialize anonymous class hudson.maven.reporters.BuildInfoRecorder$1; see: https://jenkins.io/redirect/serialization-of-anonymous-classes/
[INFO]
[INFO] --- maven-jar-plugin:3.0.0:jar (default-jar) @ torque-runtime ---
[INFO] Building jar: <https://builds.apache.org/job/Torque4-trunk/org.apache.torque$torque-runtime/ws/target/torque-runtime-4.1-SNAPSHOT.jar>
[INFO]
[INFO] --- maven-site-plugin:3.5.1:attach-descriptor (attach-descriptor) @ torque-runtime ---
[INFO]
[INFO] --- maven-source-plugin:3.0.0:jar-no-fork (attach-sources) @ torque-runtime ---
[INFO] Building jar: <https://builds.apache.org/job/Torque4-trunk/org.apache.torque$torque-runtime/ws/target/torque-runtime-4.1-SNAPSHOT-sources.jar>
[INFO]
[INFO] --- apache-rat-plugin:0.11:check (default) @ torque-runtime ---
[INFO] 51 implicit excludes (use -debug for more details).
[INFO] Exclude: velocity.log
[INFO] Exclude: .checkstyle
[INFO] Exclude: checkstyle-cache.ccf
[INFO] Exclude: derby.log
[INFO] Exclude: LICENSE-EDL.txt
[INFO] Exclude: DEPENDENCIES
[INFO] Exclude: torque-test/target/**/*
[INFO] Exclude: torque-test/.classpath
[INFO] Exclude: torque-test/.project
[INFO] Exclude: torque-test/.settings/**
[INFO] Exclude: torque-test/src/main/generated-java/**/*
[INFO] Exclude: torque-test/derby.log
[INFO] 182 resources included (use -debug for more details)
[INFO] Rat check: Summary of files. Unapproved: 0 unknown: 0 generated: 0 approved: 180 licence.
[CHECKSTYLE] No report found for mojo check
[PMD] No report found for mojo check
[INFO]
[INFO] --- dependency-check-maven:3.1.2:check (default) @ torque-runtime ---
[INFO] Skipping dependency-check
[CHECKSTYLE] No report found for mojo check
[INFO]
[PMD] No report found for mojo check[INFO] --- maven-install-plugin:2.5.2:install (default-install) @ torque-runtime ---

[INFO] Installing <https://builds.apache.org/job/Torque4-trunk/org.apache.torque$torque-runtime/ws/target/torque-runtime-4.1-SNAPSHOT.jar> to /home/jenkins/jenkins-slave/maven-repositories/1/org/apache/torque/torque-runtime/4.1-SNAPSHOT/torque-runtime-4.1-SNAPSHOT.jar
[INFO] Installing <https://builds.apache.org/job/Torque4-trunk/org.apache.torque$torque-runtime/ws/pom.xml> to /home/jenkins/jenkins-slave/maven-repositories/1/org/apache/torque/torque-runtime/4.1-SNAPSHOT/torque-runtime-4.1-SNAPSHOT.pom
[INFO] Installing <https://builds.apache.org/job/Torque4-trunk/org.apache.torque$torque-runtime/ws/target/torque-runtime-4.1-SNAPSHOT-sources.jar> to /home/jenkins/jenkins-slave/maven-repositories/1/org/apache/torque/torque-runtime/4.1-SNAPSHOT/torque-runtime-4.1-SNAPSHOT-sources.jar
[INFO]
[INFO] >>> cobertura-maven-plugin:2.3:cobertura (default-cli) > [cobertura]test @ torque-runtime >>>
[INFO]
[INFO] --- maven-remote-resources-plugin:1.5:process (process-resource-bundles) @ torque-runtime ---
[INFO]
[INFO] --- maven-resources-plugin:2.7:resources (default-resources) @ torque-runtime ---
[INFO] Using 'ISO-8859-1' encoding to copy filtered resources.
[INFO] skip non existing resourceDirectory <https://builds.apache.org/job/Torque4-trunk/org.apache.torque$torque-runtime/ws/src/main/resources>
[INFO] Copying 3 resources
[INFO] Copying 3 resources
[INFO]
[INFO] --- maven-compiler-plugin:3.5.1:compile (default-compile) @ torque-runtime ---
[INFO] Nothing to compile - all classes are up to date
[INFO]
[INFO] --- cobertura-maven-plugin:2.3:instrument (default-cli) @ torque-runtime ---
[INFO] Cobertura 1.9.2 - GNU GPL License (NO WARRANTY) - See COPYRIGHT file
Instrumenting 122 files to <https://builds.apache.org/job/Torque4-trunk/org.apache.torque$torque-runtime/ws/target/generated-classes/cobertura>
Cobertura: Saved information on 122 classes.
Instrument time: 637ms

[INFO] Instrumentation was successful.
[INFO]
[INFO] --- maven-resources-plugin:2.7:testResources (default-testResources) @ torque-runtime ---
[INFO] Using 'ISO-8859-1' encoding to copy filtered resources.
[INFO] Copying 5 resources
[INFO] Copying 3 resources
[INFO] Copying 3 resources
[INFO]
[INFO] --- maven-compiler-plugin:3.5.1:testCompile (default-testCompile) @ torque-runtime ---
[INFO] Nothing to compile - all classes are up to date
[INFO]
[INFO] --- maven-surefire-plugin:2.19.1:test (default-test) @ torque-runtime ---

-------------------------------------------------------
 T E S T S
-------------------------------------------------------

Results :

Tests run: 0, Failures: 0, Errors: 0, Skipped: 0

[JENKINS] Recording test results

---------------------------------------------------------------------
To unsubscribe, e-mail: [hidden email]
For additional commands, e-mail: [hidden email]

Reply | Threaded
Open this post in threaded view
|

Build failed in Jenkins: Torque4-trunk » Torque Runtime #583

Apache Jenkins Server-2
See <https://builds.apache.org/job/Torque4-trunk/org.apache.torque$torque-runtime/583/display/redirect?page=changes>

Changes:

[tv] Fix Spotbugs findings

------------------------------------------
[...truncated 6.80 KB...]
[INFO]
[INFO] --- maven-clean-plugin:3.0.0:clean (default-clean) @ torque-runtime ---
[INFO]
[INFO] --- maven-remote-resources-plugin:1.5:process (process-resource-bundles) @ torque-runtime ---
[INFO]
[INFO] --- maven-resources-plugin:2.7:resources (default-resources) @ torque-runtime ---
[INFO] Using 'ISO-8859-1' encoding to copy filtered resources.
[INFO] skip non existing resourceDirectory <https://builds.apache.org/job/Torque4-trunk/org.apache.torque$torque-runtime/ws/src/main/resources>
[INFO] Copying 3 resources
[INFO]
[INFO] --- maven-compiler-plugin:3.5.1:compile (default-compile) @ torque-runtime ---
[INFO] Changes detected - recompiling the module!
[INFO] Compiling 119 source files to <https://builds.apache.org/job/Torque4-trunk/org.apache.torque$torque-runtime/ws/target/classes>
[INFO]
[INFO] --- maven-resources-plugin:2.7:testResources (default-testResources) @ torque-runtime ---
[INFO] Using 'ISO-8859-1' encoding to copy filtered resources.
[INFO] Copying 5 resources
[INFO] Copying 3 resources
[INFO]
[INFO] --- maven-compiler-plugin:3.5.1:testCompile (default-testCompile) @ torque-runtime ---
[INFO] Changes detected - recompiling the module!
[INFO] Compiling 35 source files to <https://builds.apache.org/job/Torque4-trunk/org.apache.torque$torque-runtime/ws/target/test-classes>
[INFO]
[INFO] --- maven-surefire-plugin:2.19.1:test (default-test) @ torque-runtime ---
[WARNING] The parameter forkMode is deprecated since version 2.14. Use forkCount and reuseForks instead.

-------------------------------------------------------
 T E S T S
-------------------------------------------------------
Running org.apache.torque.om.ComboKeyTest
Tests run: 9, Failures: 0, Errors: 0, Skipped: 0, Time elapsed: 0.039 sec - in org.apache.torque.om.ComboKeyTest
Running org.apache.torque.om.mapper.LongMapperTest
Tests run: 3, Failures: 0, Errors: 0, Skipped: 0, Time elapsed: 0.394 sec - in org.apache.torque.om.mapper.LongMapperTest
Running org.apache.torque.om.mapper.StringMapperTest
Tests run: 3, Failures: 0, Errors: 0, Skipped: 0, Time elapsed: 0.385 sec - in org.apache.torque.om.mapper.StringMapperTest
Running org.apache.torque.om.mapper.BigDecimalMapperTest
Tests run: 3, Failures: 0, Errors: 0, Skipped: 0, Time elapsed: 0.38 sec - in org.apache.torque.om.mapper.BigDecimalMapperTest
Running org.apache.torque.om.mapper.ObjectListMapperTest
Tests run: 12, Failures: 0, Errors: 0, Skipped: 0, Time elapsed: 0.477 sec - in org.apache.torque.om.mapper.ObjectListMapperTest
Running org.apache.torque.om.mapper.IntegerMapperTest
Tests run: 3, Failures: 0, Errors: 0, Skipped: 0, Time elapsed: 0.378 sec - in org.apache.torque.om.mapper.IntegerMapperTest
Running org.apache.torque.om.mapper.CompositeMapperTest
Tests run: 2, Failures: 0, Errors: 0, Skipped: 0, Time elapsed: 0.383 sec - in org.apache.torque.om.mapper.CompositeMapperTest
Running org.apache.torque.om.mapper.DateMapperTest
Tests run: 3, Failures: 0, Errors: 0, Skipped: 0, Time elapsed: 0.381 sec - in org.apache.torque.om.mapper.DateMapperTest
Running org.apache.torque.om.NumberKeyTest
Tests run: 23, Failures: 0, Errors: 0, Skipped: 0, Time elapsed: 0.044 sec - in org.apache.torque.om.NumberKeyTest
Running org.apache.torque.adapter.DBOracleTest
Tests run: 1, Failures: 0, Errors: 0, Skipped: 0, Time elapsed: 0.034 sec - in org.apache.torque.adapter.DBOracleTest
Running org.apache.torque.criteria.CriterionTest
Tests run: 10, Failures: 0, Errors: 0, Skipped: 0, Time elapsed: 0.178 sec - in org.apache.torque.criteria.CriterionTest
Running org.apache.torque.criteria.CriteriaTest
Tests run: 33, Failures: 0, Errors: 0, Skipped: 0, Time elapsed: 0.373 sec - in org.apache.torque.criteria.CriteriaTest
Running org.apache.torque.criteria.JoinTest
Tests run: 2, Failures: 0, Errors: 0, Skipped: 0, Time elapsed: 0.14 sec - in org.apache.torque.criteria.JoinTest
Running org.apache.torque.avalon.AvalonTest
[WARNING] Unable to find any resource with the name '/componentConfiguration.properties'
[WARNING] Unable to find any resource with the name '/parameters.properties'
[INFO] YaffiContainer ready.
[INFO] YaffiContainer has been disposed.
[WARNING] Unable to find any resource with the name '/componentConfiguration.properties'
[WARNING] Unable to find any resource with the name '/parameters.properties'
[INFO] YaffiContainer ready.
[INFO] YaffiContainer has been disposed.
Tests run: 2, Failures: 0, Errors: 0, Skipped: 0, Time elapsed: 0.254 sec - in org.apache.torque.avalon.AvalonTest
Running org.apache.torque.TorqueRuntimeExceptionTest
Tests run: 1, Failures: 0, Errors: 0, Skipped: 0, Time elapsed: 0.129 sec - in org.apache.torque.TorqueRuntimeExceptionTest
Running org.apache.torque.manager.MethodResultCacheTest
Aug 24, 2018 5:24:39 PM org.apache.commons.jcs.engine.control.CompositeCacheManager getInstance
INFO: Instance is null, creating with config [/cache.ccf]
Aug 24, 2018 5:24:39 PM org.apache.commons.jcs.engine.control.CompositeCacheManager configure
INFO: Creating cache manager from config file: /cache.ccf
Aug 24, 2018 5:24:39 PM org.apache.commons.jcs.utils.threadpool.ThreadPoolManager loadConfig
INFO: thread_pool.default PoolConfiguration = useBoundary = [false] boundarySize = [2000] maximumPoolSize = [150] minimumPoolSize = [4] keepAliveTime = [300000] whenBlockedPolicy = [RUN] startUpSize = [4]
Aug 24, 2018 5:24:39 PM org.apache.commons.jcs.engine.control.CompositeCacheManager doConfigure
INFO: Setting default auxiliaries to
Aug 24, 2018 5:24:39 PM org.apache.commons.jcs.engine.control.CompositeCacheManager doConfigure
INFO: setting defaultCompositeCacheAttributes to [ useLateral = true, useRemote = true, useDisk = true, maxObjs = 1000, maxSpoolPerRun = -1, diskUsagePattern = SWAP, spoolChunkSize = 2 ]
Aug 24, 2018 5:24:39 PM org.apache.commons.jcs.engine.control.CompositeCacheConfigurator parseElementAttributes
INFO: No special ElementAttribute class defined for key [jcs.default.elementattributes], using default class.
Aug 24, 2018 5:24:39 PM org.apache.commons.jcs.engine.control.CompositeCacheManager doConfigure
INFO: setting defaultElementAttributes to [ IS_LATERAL = true, IS_SPOOL = true, IS_REMOTE = true, IS_ETERNAL = true, MaxLifeSeconds = -1, IdleTime = -1, CreateTime = 1535131479184, LastAccessTime = 1535131479184, getTimeToLiveSeconds() = -1, createTime = 1535131479184 ]
Aug 24, 2018 5:24:39 PM org.apache.commons.jcs.engine.control.CompositeCacheConfigurator parseElementAttributes
INFO: No special ElementAttribute class defined for key [jcs.region.testCache1.elementattributes], using default class.
Aug 24, 2018 5:24:39 PM org.apache.commons.jcs.engine.memory.AbstractDoubleLinkedListMemoryCache initialize
INFO: initialized MemoryCache for testCache1
Aug 24, 2018 5:24:39 PM org.apache.commons.jcs.engine.control.CompositeCache <init>
INFO: Constructed cache with name [testCache1] and cache attributes [ useLateral = true, useRemote = true, useDisk = true, maxObjs = 1000, maxSpoolPerRun = -1, diskUsagePattern = SWAP, spoolChunkSize = 2 ]
Aug 24, 2018 5:24:39 PM org.apache.commons.jcs.engine.control.CompositeCacheConfigurator parseRegions
INFO: Parsed regions [testCache1]
Aug 24, 2018 5:24:39 PM org.apache.commons.jcs.engine.control.CompositeCacheManager doConfigure
INFO: Finished configuration in 37 ms.
Tests run: 3, Failures: 0, Errors: 0, Skipped: 0, Time elapsed: 0.31 sec - in org.apache.torque.manager.MethodResultCacheTest
Aug 24, 2018 5:24:39 PM org.apache.commons.jcs.engine.control.CompositeCacheManager run
INFO: Shutdown hook activated.  Shutdown was not called.  Shutting down JCS.
Aug 24, 2018 5:24:39 PM org.apache.commons.jcs.engine.control.event.ElementEventQueue dispose
INFO: Element event queue destroyed: org.apache.commons.jcs.engine.control.event.ElementEventQueue@11a8b5c1
Running org.apache.torque.manager.AbstractBaseManagerTest
Aug 24, 2018 5:24:39 PM org.apache.commons.jcs.engine.control.CompositeCacheManager getInstance
INFO: Instance is null, creating with config [/cache.ccf]
Aug 24, 2018 5:24:40 PM org.apache.commons.jcs.engine.control.CompositeCacheManager configure
INFO: Creating cache manager from config file: /cache.ccf
Aug 24, 2018 5:24:40 PM org.apache.commons.jcs.utils.threadpool.ThreadPoolManager loadConfig
INFO: thread_pool.default PoolConfiguration = useBoundary = [false] boundarySize = [2000] maximumPoolSize = [150] minimumPoolSize = [4] keepAliveTime = [300000] whenBlockedPolicy = [RUN] startUpSize = [4]
Aug 24, 2018 5:24:40 PM org.apache.commons.jcs.engine.control.CompositeCacheManager doConfigure
INFO: Setting default auxiliaries to
Aug 24, 2018 5:24:40 PM org.apache.commons.jcs.engine.control.CompositeCacheManager doConfigure
INFO: setting defaultCompositeCacheAttributes to [ useLateral = true, useRemote = true, useDisk = true, maxObjs = 1000, maxSpoolPerRun = -1, diskUsagePattern = SWAP, spoolChunkSize = 2 ]
Aug 24, 2018 5:24:40 PM org.apache.commons.jcs.engine.control.CompositeCacheConfigurator parseElementAttributes
INFO: No special ElementAttribute class defined for key [jcs.default.elementattributes], using default class.
Aug 24, 2018 5:24:40 PM org.apache.commons.jcs.engine.control.CompositeCacheManager doConfigure
INFO: setting defaultElementAttributes to [ IS_LATERAL = true, IS_SPOOL = true, IS_REMOTE = true, IS_ETERNAL = true, MaxLifeSeconds = -1, IdleTime = -1, CreateTime = 1535131480046, LastAccessTime = 1535131480046, getTimeToLiveSeconds() = -1, createTime = 1535131480046 ]
Aug 24, 2018 5:24:40 PM org.apache.commons.jcs.engine.control.CompositeCacheConfigurator parseElementAttributes
INFO: No special ElementAttribute class defined for key [jcs.region.testCache1.elementattributes], using default class.
Aug 24, 2018 5:24:40 PM org.apache.commons.jcs.engine.memory.AbstractDoubleLinkedListMemoryCache initialize
INFO: initialized MemoryCache for testCache1
Aug 24, 2018 5:24:40 PM org.apache.commons.jcs.engine.control.CompositeCache <init>
INFO: Constructed cache with name [testCache1] and cache attributes [ useLateral = true, useRemote = true, useDisk = true, maxObjs = 1000, maxSpoolPerRun = -1, diskUsagePattern = SWAP, spoolChunkSize = 2 ]
Aug 24, 2018 5:24:40 PM org.apache.commons.jcs.engine.control.CompositeCacheConfigurator parseRegions
INFO: Parsed regions [testCache1]
Aug 24, 2018 5:24:40 PM org.apache.commons.jcs.engine.control.CompositeCacheManager doConfigure
INFO: Finished configuration in 47 ms.
Tests run: 9, Failures: 0, Errors: 0, Skipped: 0, Time elapsed: 0.328 sec - in org.apache.torque.manager.AbstractBaseManagerTest
Running org.apache.torque.ColumnImplTest
Tests run: 41, Failures: 0, Errors: 0, Skipped: 0, Time elapsed: 0.252 sec - in org.apache.torque.ColumnImplTest
Running org.apache.torque.TorqueInstanceTest
Tests run: 5, Failures: 0, Errors: 0, Skipped: 0, Time elapsed: 0.157 sec - in org.apache.torque.TorqueInstanceTest
Running org.apache.torque.sql.SqlBuilderTest
Tests run: 130, Failures: 0, Errors: 0, Skipped: 0, Time elapsed: 0.41 sec - in org.apache.torque.sql.SqlBuilderTest
Running org.apache.torque.sql.QueryTest
Tests run: 2, Failures: 0, Errors: 0, Skipped: 0, Time elapsed: 0.138 sec - in org.apache.torque.sql.QueryTest
Running org.apache.torque.map.ColumnMapTest
Tests run: 3, Failures: 0, Errors: 0, Skipped: 0, Time elapsed: 0.136 sec - in org.apache.torque.map.ColumnMapTest
Running org.apache.torque.util.UniqueListTest
Tests run: 2, Failures: 0, Errors: 0, Skipped: 0, Time elapsed: 0.027 sec - in org.apache.torque.util.UniqueListTest
Running org.apache.torque.util.BasePeerImplTest
Tests run: 16, Failures: 0, Errors: 0, Skipped: 0, Time elapsed: 0.496 sec - in org.apache.torque.util.BasePeerImplTest
Running org.apache.torque.util.functions.SumTest
Tests run: 4, Failures: 0, Errors: 0, Skipped: 0, Time elapsed: 0.033 sec - in org.apache.torque.util.functions.SumTest
Running org.apache.torque.util.functions.MinTest
Tests run: 4, Failures: 0, Errors: 0, Skipped: 0, Time elapsed: 0.043 sec - in org.apache.torque.util.functions.MinTest
Running org.apache.torque.util.functions.CountTest
Tests run: 4, Failures: 0, Errors: 0, Skipped: 0, Time elapsed: 0.046 sec - in org.apache.torque.util.functions.CountTest
Running org.apache.torque.util.functions.AggregateFunctionTest
Tests run: 12, Failures: 0, Errors: 0, Skipped: 0, Time elapsed: 0.047 sec - in org.apache.torque.util.functions.AggregateFunctionTest
Running org.apache.torque.util.functions.MaxTest
Tests run: 4, Failures: 0, Errors: 0, Skipped: 0, Time elapsed: 0.035 sec - in org.apache.torque.util.functions.MaxTest
Running org.apache.torque.util.functions.AvgTest
Tests run: 4, Failures: 0, Errors: 0, Skipped: 0, Time elapsed: 0.036 sec - in org.apache.torque.util.functions.AvgTest
Running org.apache.torque.util.functions.AbstractFunctionTest
Tests run: 11, Failures: 0, Errors: 0, Skipped: 0, Time elapsed: 0.048 sec - in org.apache.torque.util.functions.AbstractFunctionTest
Running org.apache.torque.util.SummaryHelperTest
Tests run: 1, Failures: 0, Errors: 0, Skipped: 0, Time elapsed: 0.432 sec - in org.apache.torque.util.SummaryHelperTest

Results :

Tests run: 365, Failures: 0, Errors: 0, Skipped: 0

[JENKINS] Recording test results
[WARNING] Attempt to (de-)serialize anonymous class hudson.maven.reporters.SurefireArchiver$2; see: https://jenkins.io/redirect/serialization-of-anonymous-classes/
[WARNING] Attempt to (de-)serialize anonymous class hudson.maven.reporters.BuildInfoRecorder$1; see: https://jenkins.io/redirect/serialization-of-anonymous-classes/
[INFO]
[INFO] --- maven-jar-plugin:3.0.0:jar (default-jar) @ torque-runtime ---
[INFO] Building jar: <https://builds.apache.org/job/Torque4-trunk/org.apache.torque$torque-runtime/ws/target/torque-runtime-4.1-SNAPSHOT.jar>
[INFO]
[INFO] --- maven-site-plugin:3.5.1:attach-descriptor (attach-descriptor) @ torque-runtime ---
[INFO]
[INFO] --- maven-source-plugin:3.0.0:jar-no-fork (attach-sources) @ torque-runtime ---
[INFO] Building jar: <https://builds.apache.org/job/Torque4-trunk/org.apache.torque$torque-runtime/ws/target/torque-runtime-4.1-SNAPSHOT-sources.jar>
[INFO]
[INFO] --- apache-rat-plugin:0.11:check (default) @ torque-runtime ---
[INFO] 51 implicit excludes (use -debug for more details).
[INFO] Exclude: velocity.log
[INFO] Exclude: .checkstyle
[INFO] Exclude: checkstyle-cache.ccf
[INFO] Exclude: derby.log
[INFO] Exclude: LICENSE-EDL.txt
[INFO] Exclude: DEPENDENCIES
[INFO] Exclude: torque-test/target/**/*
[INFO] Exclude: torque-test/.classpath
[INFO] Exclude: torque-test/.project
[INFO] Exclude: torque-test/.settings/**
[INFO] Exclude: torque-test/src/main/generated-java/**/*
[INFO] Exclude: torque-test/derby.log
[INFO] 182 resources included (use -debug for more details)
[INFO] Rat check: Summary of files. Unapproved: 0 unknown: 0 generated: 0 approved: 180 licence.
[CHECKSTYLE] No report found for mojo check
[PMD] No report found for mojo check
[INFO]
[INFO] --- dependency-check-maven:3.1.2:check (default) @ torque-runtime ---
[INFO] Skipping dependency-check
[CHECKSTYLE] No report found for mojo check
[PMD] No report found for mojo check[INFO]

[INFO] --- maven-install-plugin:2.5.2:install (default-install) @ torque-runtime ---
[INFO] Installing <https://builds.apache.org/job/Torque4-trunk/org.apache.torque$torque-runtime/ws/target/torque-runtime-4.1-SNAPSHOT.jar> to /home/jenkins/jenkins-slave/maven-repositories/1/org/apache/torque/torque-runtime/4.1-SNAPSHOT/torque-runtime-4.1-SNAPSHOT.jar
[INFO] Installing <https://builds.apache.org/job/Torque4-trunk/org.apache.torque$torque-runtime/ws/pom.xml> to /home/jenkins/jenkins-slave/maven-repositories/1/org/apache/torque/torque-runtime/4.1-SNAPSHOT/torque-runtime-4.1-SNAPSHOT.pom
[INFO] Installing <https://builds.apache.org/job/Torque4-trunk/org.apache.torque$torque-runtime/ws/target/torque-runtime-4.1-SNAPSHOT-sources.jar> to /home/jenkins/jenkins-slave/maven-repositories/1/org/apache/torque/torque-runtime/4.1-SNAPSHOT/torque-runtime-4.1-SNAPSHOT-sources.jar
[INFO]
[INFO] >>> cobertura-maven-plugin:2.3:cobertura (default-cli) > [cobertura]test @ torque-runtime >>>
[INFO]
[INFO] --- maven-remote-resources-plugin:1.5:process (process-resource-bundles) @ torque-runtime ---
[INFO]
[INFO] --- maven-resources-plugin:2.7:resources (default-resources) @ torque-runtime ---
[INFO] Using 'ISO-8859-1' encoding to copy filtered resources.
[INFO] skip non existing resourceDirectory <https://builds.apache.org/job/Torque4-trunk/org.apache.torque$torque-runtime/ws/src/main/resources>
[INFO] Copying 3 resources
[INFO] Copying 3 resources
[INFO]
[INFO] --- maven-compiler-plugin:3.5.1:compile (default-compile) @ torque-runtime ---
[INFO] Nothing to compile - all classes are up to date
[INFO]
[INFO] --- cobertura-maven-plugin:2.3:instrument (default-cli) @ torque-runtime ---
[INFO] Cobertura 1.9.2 - GNU GPL License (NO WARRANTY) - See COPYRIGHT file
Instrumenting 122 files to <https://builds.apache.org/job/Torque4-trunk/org.apache.torque$torque-runtime/ws/target/generated-classes/cobertura>
[cobertura] WARN  [main] net.sourceforge.cobertura.instrument.Main - Unable to instrument file <https://builds.apache.org/job/Torque4-trunk/org.apache.torque$torque-runtime/ws/target/generated-classes/cobertura/org/apache/torque/util/LargeSelect.class>
java.lang.ArrayIndexOutOfBoundsException: 53883
        at org.objectweb.asm.ClassReader.<init>(Unknown Source)
        at org.objectweb.asm.ClassReader.<init>(Unknown Source)
        at org.objectweb.asm.ClassReader.<init>(Unknown Source)
        at net.sourceforge.cobertura.instrument.Main.addInstrumentationToSingleClass(Main.java:355)
        at net.sourceforge.cobertura.instrument.Main.addInstrumentation(Main.java:416)
        at net.sourceforge.cobertura.instrument.Main.parseArguments(Main.java:492)
        at net.sourceforge.cobertura.instrument.Main.main(Main.java:514)
Cobertura: Saved information on 121 classes.
Instrument time: 514ms

[INFO] Instrumentation was successful.
[INFO]
[INFO] --- maven-resources-plugin:2.7:testResources (default-testResources) @ torque-runtime ---
[INFO] Using 'ISO-8859-1' encoding to copy filtered resources.
[INFO] Copying 5 resources
[INFO] Copying 3 resources
[INFO] Copying 3 resources
[INFO]
[INFO] --- maven-compiler-plugin:3.5.1:testCompile (default-testCompile) @ torque-runtime ---
[INFO] Nothing to compile - all classes are up to date
[INFO]
[INFO] --- maven-surefire-plugin:2.19.1:test (default-test) @ torque-runtime ---

-------------------------------------------------------
 T E S T S
-------------------------------------------------------

Results :

Tests run: 0, Failures: 0, Errors: 0, Skipped: 0

[JENKINS] Recording test results

---------------------------------------------------------------------
To unsubscribe, e-mail: [hidden email]
For additional commands, e-mail: [hidden email]

Reply | Threaded
Open this post in threaded view
|

Build failed in Jenkins: Torque4-trunk » Torque Runtime #584

Apache Jenkins Server-2
See <https://builds.apache.org/job/Torque4-trunk/org.apache.torque$torque-runtime/584/display/redirect?page=changes>

Changes:

[tv] Practice Java 8

------------------------------------------
[INFO]
[INFO] ------------------< org.apache.torque:torque-runtime >------------------
[INFO] Building Torque Runtime 4.1-SNAPSHOT                               [2/7]
[INFO] --------------------------------[ jar ]---------------------------------
[INFO] Downloading from central: https://repo.maven.apache.org/maven2/org/apache/commons/commons-jcs-core/2.2/commons-jcs-core-2.2.pom
[INFO] Downloaded from central: https://repo.maven.apache.org/maven2/org/apache/commons/commons-jcs-core/2.2/commons-jcs-core-2.2.pom (6.1 kB at 362 kB/s)
[INFO] Downloading from central: https://repo.maven.apache.org/maven2/org/apache/commons/commons-jcs/2.2/commons-jcs-2.2.pom
[INFO] Downloaded from central: https://repo.maven.apache.org/maven2/org/apache/commons/commons-jcs/2.2/commons-jcs-2.2.pom (19 kB at 1.2 MB/s)
[INFO] Downloading from central: https://repo.maven.apache.org/maven2/org/apache/fulcrum/fulcrum-testcontainer/1.0.7/fulcrum-testcontainer-1.0.7.pom
[INFO] Downloaded from central: https://repo.maven.apache.org/maven2/org/apache/fulcrum/fulcrum-testcontainer/1.0.7/fulcrum-testcontainer-1.0.7.pom (4.4 kB at 243 kB/s)
[INFO] Downloading from central: https://repo.maven.apache.org/maven2/org/apache/turbine/turbine-parent/3/turbine-parent-3.pom
[INFO] Downloaded from central: https://repo.maven.apache.org/maven2/org/apache/turbine/turbine-parent/3/turbine-parent-3.pom (20 kB at 977 kB/s)
[INFO] Downloading from central: https://repo.maven.apache.org/maven2/org/apache/fulcrum/fulcrum-yaafi/1.0.6/fulcrum-yaafi-1.0.6.pom
[INFO] Downloaded from central: https://repo.maven.apache.org/maven2/org/apache/fulcrum/fulcrum-yaafi/1.0.6/fulcrum-yaafi-1.0.6.pom (3.1 kB at 161 kB/s)
[INFO] Downloading from central: https://repo.maven.apache.org/maven2/org/apache/fulcrum/fulcrum-parent/1/fulcrum-parent-1.pom
[INFO] Downloaded from central: https://repo.maven.apache.org/maven2/org/apache/fulcrum/fulcrum-parent/1/fulcrum-parent-1.pom (19 kB at 1.1 MB/s)
[INFO] Downloading from central: https://repo.maven.apache.org/maven2/org/mockito/mockito-all/1.9.0/mockito-all-1.9.0.pom
[INFO] Downloaded from central: https://repo.maven.apache.org/maven2/org/mockito/mockito-all/1.9.0/mockito-all-1.9.0.pom (1.0 kB at 72 kB/s)
[INFO] Downloading from central: https://repo.maven.apache.org/maven2/org/apache/commons/commons-jcs-core/2.2/commons-jcs-core-2.2.jar
[INFO] Downloading from central: https://repo.maven.apache.org/maven2/org/apache/fulcrum/fulcrum-testcontainer/1.0.7/fulcrum-testcontainer-1.0.7.jar
[INFO] Downloading from central: https://repo.maven.apache.org/maven2/org/apache/fulcrum/fulcrum-yaafi/1.0.6/fulcrum-yaafi-1.0.6.jar
[INFO] Downloading from central: https://repo.maven.apache.org/maven2/org/mockito/mockito-all/1.9.0/mockito-all-1.9.0.jar
[INFO] Downloaded from central: https://repo.maven.apache.org/maven2/org/apache/fulcrum/fulcrum-testcontainer/1.0.7/fulcrum-testcontainer-1.0.7.jar (16 kB at 910 kB/s)
[INFO] Downloaded from central: https://repo.maven.apache.org/maven2/org/apache/fulcrum/fulcrum-yaafi/1.0.6/fulcrum-yaafi-1.0.6.jar (130 kB at 5.2 MB/s)
[INFO] Downloaded from central: https://repo.maven.apache.org/maven2/org/apache/commons/commons-jcs-core/2.2/commons-jcs-core-2.2.jar (535 kB at 9.4 MB/s)
[INFO] Downloaded from central: https://repo.maven.apache.org/maven2/org/mockito/mockito-all/1.9.0/mockito-all-1.9.0.jar (1.5 MB at 12 MB/s)
[INFO]
[INFO] --- maven-clean-plugin:3.0.0:clean (default-clean) @ torque-runtime ---
[INFO]
[INFO] --- maven-remote-resources-plugin:1.5:process (process-resource-bundles) @ torque-runtime ---
[INFO]
[INFO] --- maven-resources-plugin:2.7:resources (default-resources) @ torque-runtime ---
[INFO] Using 'ISO-8859-1' encoding to copy filtered resources.
[INFO] skip non existing resourceDirectory <https://builds.apache.org/job/Torque4-trunk/org.apache.torque$torque-runtime/ws/src/main/resources>
[INFO] Copying 3 resources
[INFO]
[INFO] --- maven-compiler-plugin:3.5.1:compile (default-compile) @ torque-runtime ---
[INFO] Changes detected - recompiling the module!
[INFO] Compiling 119 source files to <https://builds.apache.org/job/Torque4-trunk/org.apache.torque$torque-runtime/ws/target/classes>
[INFO] Some messages have been simplified; recompile with -Xdiags:verbose to get full output
[INFO] -------------------------------------------------------------
[ERROR] COMPILATION ERROR :
[INFO] -------------------------------------------------------------
[ERROR] <https://builds.apache.org/job/Torque4-trunk/org.apache.torque$torque-runtime/ws/src/main/java/org/apache/torque/TorqueInstance.java>:[860,35] incompatible types: invalid method reference
    method dispose in class org.apache.torque.manager.AbstractBaseManager<T> cannot be applied to given types
      required: no arguments
      found: org.apache.torque.manager.AbstractBaseManager<?>
      reason: actual and formal argument lists differ in length
[ERROR] <https://builds.apache.org/job/Torque4-trunk/org.apache.torque$torque-runtime/ws/src/main/java/org/apache/torque/TorqueInstance.java>:[860,54] invalid method reference
  non-static method dispose() cannot be referenced from a static context
[INFO] 2 errors
[INFO] -------------------------------------------------------------

---------------------------------------------------------------------
To unsubscribe, e-mail: [hidden email]
For additional commands, e-mail: [hidden email]

Reply | Threaded
Open this post in threaded view
|

Jenkins build is unstable: Torque4-trunk » Torque Runtime #585

Apache Jenkins Server-2
See <https://builds.apache.org/job/Torque4-trunk/org.apache.torque$torque-runtime/585/display/redirect?page=changes>


---------------------------------------------------------------------
To unsubscribe, e-mail: [hidden email]
For additional commands, e-mail: [hidden email]

Reply | Threaded
Open this post in threaded view
|

Jenkins build is still unstable: Torque4-trunk » Torque Runtime #586

Apache Jenkins Server-2
See <https://builds.apache.org/job/Torque4-trunk/org.apache.torque$torque-runtime/586/display/redirect?page=changes>


---------------------------------------------------------------------
To unsubscribe, e-mail: [hidden email]
For additional commands, e-mail: [hidden email]

Reply | Threaded
Open this post in threaded view
|

Jenkins build is still unstable: Torque4-trunk » Torque Runtime #587

Apache Jenkins Server-2
See <https://builds.apache.org/job/Torque4-trunk/org.apache.torque$torque-runtime/587/display/redirect>


---------------------------------------------------------------------
To unsubscribe, e-mail: [hidden email]
For additional commands, e-mail: [hidden email]

Reply | Threaded
Open this post in threaded view
|

Jenkins build is still unstable: Torque4-trunk » Torque Runtime #588

Apache Jenkins Server-2
See <https://builds.apache.org/job/Torque4-trunk/org.apache.torque$torque-runtime/588/display/redirect?page=changes>


---------------------------------------------------------------------
To unsubscribe, e-mail: [hidden email]
For additional commands, e-mail: [hidden email]

Reply | Threaded
Open this post in threaded view
|

Jenkins build is still unstable: Torque4-trunk » Torque Runtime #589

Apache Jenkins Server-2
See <https://builds.apache.org/job/Torque4-trunk/org.apache.torque$torque-runtime/589/display/redirect?page=changes>


---------------------------------------------------------------------
To unsubscribe, e-mail: [hidden email]
For additional commands, e-mail: [hidden email]

Reply | Threaded
Open this post in threaded view
|

Jenkins build is still unstable: Torque4-trunk » Torque Runtime #590

Apache Jenkins Server-2
See <https://builds.apache.org/job/Torque4-trunk/org.apache.torque$torque-runtime/590/display/redirect?page=changes>


---------------------------------------------------------------------
To unsubscribe, e-mail: [hidden email]
For additional commands, e-mail: [hidden email]

Reply | Threaded
Open this post in threaded view
|

Jenkins build is back to stable : Torque4-trunk » Torque Runtime #591

Apache Jenkins Server-2
See <https://builds.apache.org/job/Torque4-trunk/org.apache.torque$torque-runtime/591/display/redirect?page=changes>


---------------------------------------------------------------------
To unsubscribe, e-mail: [hidden email]
For additional commands, e-mail: [hidden email]