Build failed in Jenkins: Torque4-trunk » Torque Templates #635

classic Classic list List threaded Threaded
3 messages Options
Reply | Threaded
Open this post in threaded view
|

Build failed in Jenkins: Torque4-trunk » Torque Templates #635

Apache Jenkins Server-2
See <https://builds.apache.org/job/Torque4-trunk/org.apache.torque$torque-templates/635/display/redirect?page=changes>

Changes:

[gk] - extracted java related transformer class from OMColumnTransformer
- fixed not generated enum imports in vm-templates
- add not generated, expected test classes (schema.xml)
- removed not allowed empty scale attribute
- add enum JavaType, but this is not yet generated correctly, cf. OMColumnJavaTransformer#setFieldJavaType
- add missing dependency
- set eol to native to test expected sql

------------------------------------------
[...truncated 104.53 KB...]
2019-04-03 15:35:27,223 [main] INFO  | org.apache.torque.generator.control.Controller - Start generation of File <https://builds.apache.org/job/Torque4-trunk/org.apache.torque$torque-templates/ws/./target/generated-sources/org/apache/torque/test/manager/base/BaseAManager.java>
2019-04-03 15:35:27,224 [main] INFO  | org.apache.torque.generator.control.Controller - Start generation of File <https://builds.apache.org/job/Torque4-trunk/org.apache.torque$torque-templates/ws/./target/generated-sources/org/apache/torque/test/manager/base/BaseBManager.java>
2019-04-03 15:35:27,225 [main] INFO  | org.apache.torque.generator.control.Controller - Start generation of File <https://builds.apache.org/job/Torque4-trunk/org.apache.torque$torque-templates/ws/./target/generated-sources/org/apache/torque/test/manager/base/BaseRAbManager.java>
2019-04-03 15:35:27,225 [main] INFO  | org.apache.torque.generator.control.Controller - Start generation of File <https://builds.apache.org/job/Torque4-trunk/org.apache.torque$torque-templates/ws/./target/generated-sources/org/apache/torque/test/manager/base/BaseCManager.java>
2019-04-03 15:35:27,226 [main] INFO  | org.apache.torque.generator.control.Controller - Start generation of File <https://builds.apache.org/job/Torque4-trunk/org.apache.torque$torque-templates/ws/./target/generated-sources/org/apache/torque/test/manager/base/BaseDManager.java>
2019-04-03 15:35:27,226 [main] INFO  | org.apache.torque.generator.control.Controller - Start generation of File <https://builds.apache.org/job/Torque4-trunk/org.apache.torque$torque-templates/ws/./target/generated-sources/org/apache/torque/test/manager/base/BaseNopkManager.java>
2019-04-03 15:35:27,227 [main] INFO  | org.apache.torque.generator.control.Controller - Start generation of File <https://builds.apache.org/job/Torque4-trunk/org.apache.torque$torque-templates/ws/./target/generated-sources/org/apache/torque/test/manager/base/BaseMultipkSelfReftableManager.java>
2019-04-03 15:35:27,227 [main] INFO  | org.apache.torque.generator.control.Controller - Start generation of File <https://builds.apache.org/job/Torque4-trunk/org.apache.torque$torque-templates/ws/./target/generated-sources/org/apache/torque/test/manager/base/BaseTestInterfaceManager.java>
2019-04-03 15:35:27,227 [main] INFO  | org.apache.torque.generator.control.Controller - Start generation of File <https://builds.apache.org/job/Torque4-trunk/org.apache.torque$torque-templates/ws/./target/generated-sources/org/apache/torque/test/manager/base/BaseLocalTestInterfaceManager.java>
2019-04-03 15:35:27,227 [main] INFO  | org.apache.torque.generator.control.Controller - Start generation of File <https://builds.apache.org/job/Torque4-trunk/org.apache.torque$torque-templates/ws/./target/generated-sources/org/apache/torque/test/manager/base/BaseInheritanceTestManager.java>
2019-04-03 15:35:27,228 [main] INFO  | org.apache.torque.generator.control.Controller - Start generation of File <https://builds.apache.org/job/Torque4-trunk/org.apache.torque$torque-templates/ws/./target/generated-sources/org/apache/torque/test/manager/base/BaseExtSchemaManager.java>
2019-04-03 15:35:27,228 [main] INFO  | org.apache.torque.generator.control.Controller - Start generation of File <https://builds.apache.org/job/Torque4-trunk/org.apache.torque$torque-templates/ws/./target/generated-sources/org/apache/torque/test/manager/base/BaseExtextSchemaManager.java>
2019-04-03 15:35:27,228 [main] INFO  | org.apache.torque.generator.control.Controller - Start generation of File <https://builds.apache.org/job/Torque4-trunk/org.apache.torque$torque-templates/ws/./target/generated-sources/org/apache/torque/test/manager/base/BaseQualifiedNameManager.java>
2019-04-03 15:35:27,228 [main] INFO  | org.apache.torque.generator.control.Controller - Processing output torque.om.baseManagerForView
2019-04-03 15:35:27,228 [main] INFO  | org.apache.torque.generator.control.Controller - Processing source <https://builds.apache.org/job/Torque4-trunk/org.apache.torque$torque-templates/ws/src/test/schema/./schema.xml>
2019-04-03 15:35:27,241 [main] INFO  | org.apache.torque.generator.control.Controller - Start generation of File <https://builds.apache.org/job/Torque4-trunk/org.apache.torque$torque-templates/ws/./target/generated-sources/org/apache/torque/test/manager/base/BaseABManager.java>
[ERROR] Tests run: 9, Failures: 2, Errors: 0, Skipped: 0, Time elapsed: 8.883 s <<< FAILURE! - in org.apache.torque.templates.TestProcessing
[ERROR] testSqlCreatedbTemplates  Time elapsed: 1.282 s  <<< FAILURE!
org.opentest4j.AssertionFailedError:
expected: <drop database if exists bookstore;
create database bookstore;
> but was: <drop database if exists bookstore;
create database bookstore;
>
        at org.apache.torque.templates.TestProcessing.assertOutput(TestProcessing.java:386)
        at org.apache.torque.templates.TestProcessing.testSqlCreatedbTemplates(TestProcessing.java:162)

[ERROR] testIdtableTemplates  Time elapsed: 0.096 s  <<< FAILURE!
org.opentest4j.AssertionFailedError:
expected: <insert into ID_TABLE (id_table_id, table_name, next_id, quantity) VALUES (103, 'a', 1000, 10);
insert into ID_TABLE (id_table_id, table_name, next_id, quantity) VALUES (104, 'b', 1000, 10);
insert into ID_TABLE (id_table_id, table_name, next_id, quantity) VALUES (105, 'r_ab', 1000, 10);
insert into ID_TABLE (id_table_id, table_name, next_id, quantity) VALUES (106, 'c', 1000, 10);
insert into ID_TABLE (id_table_id, table_name, next_id, quantity) VALUES (107, 'd', 1000, 10);
insert into ID_TABLE (id_table_id, table_name, next_id, quantity) VALUES (108, 'nopk', 1000, 10);
insert into ID_TABLE (id_table_id, table_name, next_id, quantity) VALUES (109, 'MULTIPK_SELF_REFTABLE', 1000, 10);
insert into ID_TABLE (id_table_id, table_name, next_id, quantity) VALUES (110, 'ifc_table', 1000, 10);
insert into ID_TABLE (id_table_id, table_name, next_id, quantity) VALUES (111, 'ifc_table2', 1000, 10);
insert into ID_TABLE (id_table_id, table_name, next_id, quantity) VALUES (112, 'INHERITANCE_TEST', 1000, 10);
insert into ID_TABLE (id_table_id, table_name, next_id, quantity) VALUES (113, 'ext_schema', 1000, 10);
insert into ID_TABLE (id_table_id, table_name, next_id, quantity) VALUES (114, 'extext_schema', 1000, 10);
insert into ID_TABLE (id_table_id, table_name, next_id, quantity) VALUES (115, 'qualified_name', 1000, 10);

> but was: <insert into ID_TABLE (id_table_id, table_name, next_id, quantity) VALUES (103, 'a', 1000, 10);
insert into ID_TABLE (id_table_id, table_name, next_id, quantity) VALUES (104, 'b', 1000, 10);
insert into ID_TABLE (id_table_id, table_name, next_id, quantity) VALUES (105, 'r_ab', 1000, 10);
insert into ID_TABLE (id_table_id, table_name, next_id, quantity) VALUES (106, 'c', 1000, 10);
insert into ID_TABLE (id_table_id, table_name, next_id, quantity) VALUES (107, 'd', 1000, 10);
insert into ID_TABLE (id_table_id, table_name, next_id, quantity) VALUES (108, 'nopk', 1000, 10);
insert into ID_TABLE (id_table_id, table_name, next_id, quantity) VALUES (109, 'MULTIPK_SELF_REFTABLE', 1000, 10);
insert into ID_TABLE (id_table_id, table_name, next_id, quantity) VALUES (110, 'ifc_table', 1000, 10);
insert into ID_TABLE (id_table_id, table_name, next_id, quantity) VALUES (111, 'ifc_table2', 1000, 10);
insert into ID_TABLE (id_table_id, table_name, next_id, quantity) VALUES (112, 'INHERITANCE_TEST', 1000, 10);
insert into ID_TABLE (id_table_id, table_name, next_id, quantity) VALUES (113, 'ext_schema', 1000, 10);
insert into ID_TABLE (id_table_id, table_name, next_id, quantity) VALUES (114, 'extext_schema', 1000, 10);
insert into ID_TABLE (id_table_id, table_name, next_id, quantity) VALUES (115, 'qualified_name', 1000, 10);

>
        at org.apache.torque.templates.TestProcessing.assertOutput(TestProcessing.java:386)
        at org.apache.torque.templates.TestProcessing.testIdtableTemplates(TestProcessing.java:208)

[INFO] Running org.apache.torque.templates.jdbc2schema.Jdbc2SchemaTest
2019-04-03 15:35:29,852 [main] INFO  | org.apache.torque.generator.control.Controller - readConfiguration() : Starting to read configuration files
2019-04-03 15:35:30,135 [main] INFO  | org.apache.torque.generator.control.Controller - readConfiguration() : Configuration read.
2019-04-03 15:35:30,138 [main] INFO  | org.apache.torque.generator.control.Controller - Processing output jdbc2schema
2019-04-03 15:35:30,140 [main] INFO  | org.apache.torque.generator.control.Controller - Processing source JdbcMetadataSource using url jdbc:derby:memory:myDb;create=true
2019-04-03 15:35:30,684 [main] INFO  | org.apache.torque.generator.control.Controller - Start generation of File <https://builds.apache.org/job/Torque4-trunk/org.apache.torque$torque-templates/ws/target/generated-schema/schema.xml>
[INFO] Tests run: 1, Failures: 0, Errors: 0, Skipped: 0, Time elapsed: 2.846 s - in org.apache.torque.templates.jdbc2schema.Jdbc2SchemaTest
[INFO] Running org.apache.torque.templates.GenerateOmClassesFromJavaTest
2019-04-03 15:35:32,636 [main] INFO  | org.apache.torque.generator.control.Controller - readConfiguration() : Starting to read configuration files
2019-04-03 15:35:33,097 [main] INFO  | org.apache.torque.generator.control.Controller - readConfiguration() : Configuration read.
2019-04-03 15:35:33,101 [main] INFO  | org.apache.torque.generator.control.Controller - Processing output torque.om.dbObject
2019-04-03 15:35:33,104 [main] INFO  | org.apache.torque.generator.control.Controller - Processing source <https://builds.apache.org/job/Torque4-trunk/org.apache.torque$torque-templates/ws/src/test/simple-schema/./schema.xml>
2019-04-03 15:35:33,193 [main] INFO  | org.apache.torque.generator.control.Controller - Start generation of File <https://builds.apache.org/job/Torque4-trunk/org.apache.torque$torque-templates/ws/target/generateOmClassesFromJava/modifiable/org/apache/torque/templates/test/A.java>
2019-04-03 15:35:33,415 [main] INFO  | org.apache.torque.generator.control.Controller - Processing output torque.om.dbObjectForView
2019-04-03 15:35:33,415 [main] INFO  | org.apache.torque.generator.control.Controller - Processing source <https://builds.apache.org/job/Torque4-trunk/org.apache.torque$torque-templates/ws/src/test/simple-schema/./schema.xml>
2019-04-03 15:35:33,432 [main] INFO  | org.apache.torque.generator.control.Controller - No start Elements found for path all-views/view
2019-04-03 15:35:33,432 [main] INFO  | org.apache.torque.generator.control.Controller - Processing output torque.om.baseDbObject
2019-04-03 15:35:33,433 [main] INFO  | org.apache.torque.generator.control.Controller - Processing source <https://builds.apache.org/job/Torque4-trunk/org.apache.torque$torque-templates/ws/src/test/simple-schema/./schema.xml>
2019-04-03 15:35:33,448 [main] INFO  | org.apache.torque.generator.control.Controller - Start generation of File <https://builds.apache.org/job/Torque4-trunk/org.apache.torque$torque-templates/ws/target/generateOmClassesFromJava/default/org/apache/torque/templates/test/BaseA.java>
2019-04-03 15:35:33,632 [main] INFO  | org.apache.torque.generator.control.Controller - Processing output torque.om.baseDbObjectForView
2019-04-03 15:35:33,632 [main] INFO  | org.apache.torque.generator.control.Controller - Processing source <https://builds.apache.org/job/Torque4-trunk/org.apache.torque$torque-templates/ws/src/test/simple-schema/./schema.xml>
2019-04-03 15:35:33,644 [main] INFO  | org.apache.torque.generator.control.Controller - No start Elements found for path all-views/view
2019-04-03 15:35:33,644 [main] INFO  | org.apache.torque.generator.control.Controller - Processing output torque.om.inheritanceDbObject
2019-04-03 15:35:33,645 [main] INFO  | org.apache.torque.generator.control.Controller - Processing source <https://builds.apache.org/job/Torque4-trunk/org.apache.torque$torque-templates/ws/src/test/simple-schema/./schema.xml>
2019-04-03 15:35:33,655 [main] INFO  | org.apache.torque.generator.control.Controller - No start Elements found for path all-tables/table/column/inheritance
2019-04-03 15:35:33,655 [main] INFO  | org.apache.torque.generator.control.Controller - Processing output torque.om.inheritanceDbObjectForView
2019-04-03 15:35:33,655 [main] INFO  | org.apache.torque.generator.control.Controller - Processing source <https://builds.apache.org/job/Torque4-trunk/org.apache.torque$torque-templates/ws/src/test/simple-schema/./schema.xml>
2019-04-03 15:35:33,665 [main] INFO  | org.apache.torque.generator.control.Controller - No start Elements found for path all-views/view/column/inheritance
2019-04-03 15:35:33,665 [main] INFO  | org.apache.torque.generator.control.Controller - Processing output torque.om.enum
2019-04-03 15:35:33,666 [main] INFO  | org.apache.torque.generator.control.Controller - Processing source <https://builds.apache.org/job/Torque4-trunk/org.apache.torque$torque-templates/ws/src/test/simple-schema/./schema.xml>
2019-04-03 15:35:33,677 [main] INFO  | org.apache.torque.generator.control.Controller - Start generation of File <https://builds.apache.org/job/Torque4-trunk/org.apache.torque$torque-templates/ws/target/generateOmClassesFromJava/default/org/apache/torque/templates/test/AIdEnum.java>
2019-04-03 15:35:33,678 [main] INFO  | org.apache.torque.generator.control.Controller - Start generation of File <https://builds.apache.org/job/Torque4-trunk/org.apache.torque$torque-templates/ws/target/generateOmClassesFromJava/default/org/apache/torque/templates/test/NameEnum.java>
2019-04-03 15:35:33,678 [main] INFO  | org.apache.torque.generator.control.Controller - Processing output torque.om.enumForView
2019-04-03 15:35:33,678 [main] INFO  | org.apache.torque.generator.control.Controller - Processing source <https://builds.apache.org/job/Torque4-trunk/org.apache.torque$torque-templates/ws/src/test/simple-schema/./schema.xml>
2019-04-03 15:35:33,689 [main] INFO  | org.apache.torque.generator.control.Controller - No start Elements found for path all-views/view/column
2019-04-03 15:35:33,690 [main] INFO  | org.apache.torque.generator.control.Controller - Processing output torque.om.interface
2019-04-03 15:35:33,690 [main] INFO  | org.apache.torque.generator.control.Controller - Processing source <https://builds.apache.org/job/Torque4-trunk/org.apache.torque$torque-templates/ws/src/test/simple-schema/./schema.xml>
2019-04-03 15:35:33,701 [main] INFO  | org.apache.torque.generator.control.Controller - Start generation of File <https://builds.apache.org/job/Torque4-trunk/org.apache.torque$torque-templates/ws/target/generateOmClassesFromJava/modifiable/org/apache/torque/templates/test/.java>
2019-04-03 15:35:33,701 [main] INFO  | org.apache.torque.generator.control.Controller - Processing output torque.om.peerInterface
2019-04-03 15:35:33,702 [main] INFO  | org.apache.torque.generator.control.Controller - Processing source <https://builds.apache.org/job/Torque4-trunk/org.apache.torque$torque-templates/ws/src/test/simple-schema/./schema.xml>
2019-04-03 15:35:33,713 [main] INFO  | org.apache.torque.generator.control.Controller - Start generation of File <https://builds.apache.org/job/Torque4-trunk/org.apache.torque$torque-templates/ws/target/generateOmClassesFromJava/modifiable/org/apache/torque/templates/test/.java>
2019-04-03 15:35:33,713 [main] INFO  | org.apache.torque.generator.control.Controller - Processing output torque.om.peer
2019-04-03 15:35:33,713 [main] INFO  | org.apache.torque.generator.control.Controller - Processing source <https://builds.apache.org/job/Torque4-trunk/org.apache.torque$torque-templates/ws/src/test/simple-schema/./schema.xml>
2019-04-03 15:35:33,725 [main] INFO  | org.apache.torque.generator.control.Controller - Start generation of File <https://builds.apache.org/job/Torque4-trunk/org.apache.torque$torque-templates/ws/target/generateOmClassesFromJava/modifiable/org/apache/torque/templates/test/APeer.java>
2019-04-03 15:35:33,730 [main] INFO  | org.apache.torque.generator.control.Controller - Processing output torque.om.peerForView
2019-04-03 15:35:33,730 [main] INFO  | org.apache.torque.generator.control.Controller - Processing source <https://builds.apache.org/job/Torque4-trunk/org.apache.torque$torque-templates/ws/src/test/simple-schema/./schema.xml>
2019-04-03 15:35:33,741 [main] INFO  | org.apache.torque.generator.control.Controller - No start Elements found for path all-views/view
2019-04-03 15:35:33,741 [main] INFO  | org.apache.torque.generator.control.Controller - Processing output torque.om.peer.impl
2019-04-03 15:35:33,741 [main] INFO  | org.apache.torque.generator.control.Controller - Processing source <https://builds.apache.org/job/Torque4-trunk/org.apache.torque$torque-templates/ws/src/test/simple-schema/./schema.xml>
2019-04-03 15:35:33,753 [main] INFO  | org.apache.torque.generator.control.Controller - Start generation of File <https://builds.apache.org/job/Torque4-trunk/org.apache.torque$torque-templates/ws/target/generateOmClassesFromJava/modifiable/org/apache/torque/templates/test/APeerImpl.java>
2019-04-03 15:35:33,760 [main] INFO  | org.apache.torque.generator.control.Controller - Processing output torque.om.peerForView.impl
2019-04-03 15:35:33,760 [main] INFO  | org.apache.torque.generator.control.Controller - Processing source <https://builds.apache.org/job/Torque4-trunk/org.apache.torque$torque-templates/ws/src/test/simple-schema/./schema.xml>
2019-04-03 15:35:33,771 [main] INFO  | org.apache.torque.generator.control.Controller - No start Elements found for path all-views/view
2019-04-03 15:35:33,771 [main] INFO  | org.apache.torque.generator.control.Controller - Processing output torque.om.basePeer
2019-04-03 15:35:33,771 [main] INFO  | org.apache.torque.generator.control.Controller - Processing source <https://builds.apache.org/job/Torque4-trunk/org.apache.torque$torque-templates/ws/src/test/simple-schema/./schema.xml>
2019-04-03 15:35:33,782 [main] INFO  | org.apache.torque.generator.control.Controller - Start generation of File <https://builds.apache.org/job/Torque4-trunk/org.apache.torque$torque-templates/ws/target/generateOmClassesFromJava/default/org/apache/torque/templates/test/BaseAPeer.java>
2019-04-03 15:35:33,897 [main] INFO  | org.apache.torque.generator.control.Controller - Processing output torque.om.basePeerForView
2019-04-03 15:35:33,897 [main] INFO  | org.apache.torque.generator.control.Controller - Processing source <https://builds.apache.org/job/Torque4-trunk/org.apache.torque$torque-templates/ws/src/test/simple-schema/./schema.xml>
2019-04-03 15:35:33,907 [main] INFO  | org.apache.torque.generator.control.Controller - No start Elements found for path all-views/view
2019-04-03 15:35:33,907 [main] INFO  | org.apache.torque.generator.control.Controller - Processing output torque.om.basePeer.impl
2019-04-03 15:35:33,907 [main] INFO  | org.apache.torque.generator.control.Controller - Processing source <https://builds.apache.org/job/Torque4-trunk/org.apache.torque$torque-templates/ws/src/test/simple-schema/./schema.xml>
2019-04-03 15:35:33,917 [main] INFO  | org.apache.torque.generator.control.Controller - Start generation of File <https://builds.apache.org/job/Torque4-trunk/org.apache.torque$torque-templates/ws/target/generateOmClassesFromJava/default/org/apache/torque/templates/test/BaseAPeerImpl.java>
2019-04-03 15:35:33,965 [main] INFO  | org.apache.torque.generator.control.Controller - Processing output torque.om.basePeerForView.impl
2019-04-03 15:35:33,965 [main] INFO  | org.apache.torque.generator.control.Controller - Processing source <https://builds.apache.org/job/Torque4-trunk/org.apache.torque$torque-templates/ws/src/test/simple-schema/./schema.xml>
2019-04-03 15:35:33,974 [main] INFO  | org.apache.torque.generator.control.Controller - No start Elements found for path all-views/view
2019-04-03 15:35:33,974 [main] INFO  | org.apache.torque.generator.control.Controller - Processing output torque.om.recordMapper
2019-04-03 15:35:33,974 [main] INFO  | org.apache.torque.generator.control.Controller - Processing source <https://builds.apache.org/job/Torque4-trunk/org.apache.torque$torque-templates/ws/src/test/simple-schema/./schema.xml>
2019-04-03 15:35:33,983 [main] INFO  | org.apache.torque.generator.control.Controller - Start generation of File <https://builds.apache.org/job/Torque4-trunk/org.apache.torque$torque-templates/ws/target/generateOmClassesFromJava/modifiable/org/apache/torque/templates/test/ARecordMapper.java>
2019-04-03 15:35:33,987 [main] INFO  | org.apache.torque.generator.control.Controller - Processing output torque.om.recordMapperForView
2019-04-03 15:35:33,987 [main] INFO  | org.apache.torque.generator.control.Controller - Processing source <https://builds.apache.org/job/Torque4-trunk/org.apache.torque$torque-templates/ws/src/test/simple-schema/./schema.xml>
2019-04-03 15:35:33,995 [main] INFO  | org.apache.torque.generator.control.Controller - No start Elements found for path all-views/view
2019-04-03 15:35:33,995 [main] INFO  | org.apache.torque.generator.control.Controller - Processing output torque.om.baseRecordMapper
2019-04-03 15:35:33,995 [main] INFO  | org.apache.torque.generator.control.Controller - Processing source <https://builds.apache.org/job/Torque4-trunk/org.apache.torque$torque-templates/ws/src/test/simple-schema/./schema.xml>
2019-04-03 15:35:34,003 [main] INFO  | org.apache.torque.generator.control.Controller - Start generation of File <https://builds.apache.org/job/Torque4-trunk/org.apache.torque$torque-templates/ws/target/generateOmClassesFromJava/default/org/apache/torque/templates/test/BaseARecordMapper.java>
2019-04-03 15:35:34,011 [main] INFO  | org.apache.torque.generator.control.Controller - Processing output torque.om.baseRecordMapperForView
2019-04-03 15:35:34,011 [main] INFO  | org.apache.torque.generator.control.Controller - Processing source <https://builds.apache.org/job/Torque4-trunk/org.apache.torque$torque-templates/ws/src/test/simple-schema/./schema.xml>
2019-04-03 15:35:34,018 [main] INFO  | org.apache.torque.generator.control.Controller - No start Elements found for path all-views/view
2019-04-03 15:35:34,018 [main] INFO  | org.apache.torque.generator.control.Controller - Processing output torque.om.bean
2019-04-03 15:35:34,019 [main] INFO  | org.apache.torque.generator.control.Controller - Processing source <https://builds.apache.org/job/Torque4-trunk/org.apache.torque$torque-templates/ws/src/test/simple-schema/./schema.xml>
2019-04-03 15:35:34,027 [main] INFO  | org.apache.torque.generator.control.Controller - Start generation of File <https://builds.apache.org/job/Torque4-trunk/org.apache.torque$torque-templates/ws/target/generateOmClassesFromJava/modifiable/org/apache/torque/templates/test/bean/ABean.java>
2019-04-03 15:35:34,027 [main] INFO  | org.apache.torque.generator.control.Controller - Processing output torque.om.beanForView
2019-04-03 15:35:34,027 [main] INFO  | org.apache.torque.generator.control.Controller - Processing source <https://builds.apache.org/job/Torque4-trunk/org.apache.torque$torque-templates/ws/src/test/simple-schema/./schema.xml>
2019-04-03 15:35:34,034 [main] INFO  | org.apache.torque.generator.control.Controller - No start Elements found for path all-views/view
2019-04-03 15:35:34,034 [main] INFO  | org.apache.torque.generator.control.Controller - Processing output torque.om.baseBean
2019-04-03 15:35:34,034 [main] INFO  | org.apache.torque.generator.control.Controller - Processing source <https://builds.apache.org/job/Torque4-trunk/org.apache.torque$torque-templates/ws/src/test/simple-schema/./schema.xml>
2019-04-03 15:35:34,041 [main] INFO  | org.apache.torque.generator.control.Controller - Start generation of File <https://builds.apache.org/job/Torque4-trunk/org.apache.torque$torque-templates/ws/target/generateOmClassesFromJava/default/org/apache/torque/templates/test/bean/BaseABean.java>
2019-04-03 15:35:34,041 [main] INFO  | org.apache.torque.generator.control.Controller - Processing output torque.om.baseBeanForView
2019-04-03 15:35:34,041 [main] INFO  | org.apache.torque.generator.control.Controller - Processing source <https://builds.apache.org/job/Torque4-trunk/org.apache.torque$torque-templates/ws/src/test/simple-schema/./schema.xml>
2019-04-03 15:35:34,048 [main] INFO  | org.apache.torque.generator.control.Controller - No start Elements found for path all-views/view
2019-04-03 15:35:34,048 [main] INFO  | org.apache.torque.generator.control.Controller - Processing output torque.om.inheritanceBean
2019-04-03 15:35:34,048 [main] INFO  | org.apache.torque.generator.control.Controller - Processing source <https://builds.apache.org/job/Torque4-trunk/org.apache.torque$torque-templates/ws/src/test/simple-schema/./schema.xml>
2019-04-03 15:35:34,054 [main] INFO  | org.apache.torque.generator.control.Controller - No start Elements found for path all-tables/table/column/inheritance
2019-04-03 15:35:34,054 [main] INFO  | org.apache.torque.generator.control.Controller - Processing output torque.om.inheritanceBeanForView
2019-04-03 15:35:34,054 [main] INFO  | org.apache.torque.generator.control.Controller - Processing source <https://builds.apache.org/job/Torque4-trunk/org.apache.torque$torque-templates/ws/src/test/simple-schema/./schema.xml>
2019-04-03 15:35:34,061 [main] INFO  | org.apache.torque.generator.control.Controller - No start Elements found for path all-views/view/column/inheritance
2019-04-03 15:35:34,061 [main] INFO  | org.apache.torque.generator.control.Controller - Processing output torque.om.mapInit
2019-04-03 15:35:34,062 [main] INFO  | org.apache.torque.generator.control.Controller - Processing source src/test/simple-schema/./schema.xml
2019-04-03 15:35:34,069 [main] INFO  | org.apache.torque.generator.control.Controller - Start generation of File <https://builds.apache.org/job/Torque4-trunk/org.apache.torque$torque-templates/ws/target/generateOmClassesFromJava/modifiable/org/apache/torque/linkage/BookstoreDatabaseMapInit.java>
2019-04-03 15:35:34,070 [main] INFO  | org.apache.torque.generator.control.Controller - Processing output torque.om.baseMapInit
2019-04-03 15:35:34,070 [main] INFO  | org.apache.torque.generator.control.Controller - Processing source src/test/simple-schema/./schema.xml
2019-04-03 15:35:34,076 [main] INFO  | org.apache.torque.generator.control.Controller - Start generation of File <https://builds.apache.org/job/Torque4-trunk/org.apache.torque$torque-templates/ws/target/generateOmClassesFromJava/default/org/apache/torque/templates/test/BaseBookstoreDatabaseMapInit.java>
2019-04-03 15:35:34,077 [main] INFO  | org.apache.torque.generator.control.Controller - Processing output torque.om.manager
2019-04-03 15:35:34,077 [main] INFO  | org.apache.torque.generator.control.Controller - Processing source <https://builds.apache.org/job/Torque4-trunk/org.apache.torque$torque-templates/ws/src/test/simple-schema/./schema.xml>
2019-04-03 15:35:34,084 [main] INFO  | org.apache.torque.generator.control.Controller - Start generation of File <https://builds.apache.org/job/Torque4-trunk/org.apache.torque$torque-templates/ws/target/generateOmClassesFromJava/modifiable/org/apache/torque/templates/test/manager/AManager.java>
2019-04-03 15:35:34,084 [main] INFO  | org.apache.torque.generator.control.Controller - Processing output torque.om.managerForView
2019-04-03 15:35:34,085 [main] INFO  | org.apache.torque.generator.control.Controller - Processing source <https://builds.apache.org/job/Torque4-trunk/org.apache.torque$torque-templates/ws/src/test/simple-schema/./schema.xml>
2019-04-03 15:35:34,092 [main] INFO  | org.apache.torque.generator.control.Controller - No start Elements found for path all-views/view
2019-04-03 15:35:34,092 [main] INFO  | org.apache.torque.generator.control.Controller - Processing output torque.om.baseManager
2019-04-03 15:35:34,092 [main] INFO  | org.apache.torque.generator.control.Controller - Processing source <https://builds.apache.org/job/Torque4-trunk/org.apache.torque$torque-templates/ws/src/test/simple-schema/./schema.xml>
2019-04-03 15:35:34,099 [main] INFO  | org.apache.torque.generator.control.Controller - Start generation of File <https://builds.apache.org/job/Torque4-trunk/org.apache.torque$torque-templates/ws/target/generateOmClassesFromJava/default/org/apache/torque/templates/test/manager/base/BaseAManager.java>
2019-04-03 15:35:34,099 [main] INFO  | org.apache.torque.generator.control.Controller - Processing output torque.om.baseManagerForView
2019-04-03 15:35:34,100 [main] INFO  | org.apache.torque.generator.control.Controller - Processing source <https://builds.apache.org/job/Torque4-trunk/org.apache.torque$torque-templates/ws/src/test/simple-schema/./schema.xml>
2019-04-03 15:35:34,107 [main] INFO  | org.apache.torque.generator.control.Controller - No start Elements found for path all-views/view
[INFO] Tests run: 1, Failures: 0, Errors: 0, Skipped: 0, Time elapsed: 2.147 s - in org.apache.torque.templates.GenerateOmClassesFromJavaTest
[INFO]
[INFO] Results:
[INFO]
[ERROR] Failures:
[ERROR]   TestProcessing.testIdtableTemplates:208->assertOutput:386 expected: <insert into ID_TABLE (id_table_id, table_name, next_id, quantity) VALUES (103, 'a', 1000, 10);
insert into ID_TABLE (id_table_id, table_name, next_id, quantity) VALUES (104, 'b', 1000, 10);
insert into ID_TABLE (id_table_id, table_name, next_id, quantity) VALUES (105, 'r_ab', 1000, 10);
insert into ID_TABLE (id_table_id, table_name, next_id, quantity) VALUES (106, 'c', 1000, 10);
insert into ID_TABLE (id_table_id, table_name, next_id, quantity) VALUES (107, 'd', 1000, 10);
insert into ID_TABLE (id_table_id, table_name, next_id, quantity) VALUES (108, 'nopk', 1000, 10);
insert into ID_TABLE (id_table_id, table_name, next_id, quantity) VALUES (109, 'MULTIPK_SELF_REFTABLE', 1000, 10);
insert into ID_TABLE (id_table_id, table_name, next_id, quantity) VALUES (110, 'ifc_table', 1000, 10);
insert into ID_TABLE (id_table_id, table_name, next_id, quantity) VALUES (111, 'ifc_table2', 1000, 10);
insert into ID_TABLE (id_table_id, table_name, next_id, quantity) VALUES (112, 'INHERITANCE_TEST', 1000, 10);
insert into ID_TABLE (id_table_id, table_name, next_id, quantity) VALUES (113, 'ext_schema', 1000, 10);
insert into ID_TABLE (id_table_id, table_name, next_id, quantity) VALUES (114, 'extext_schema', 1000, 10);
insert into ID_TABLE (id_table_id, table_name, next_id, quantity) VALUES (115, 'qualified_name', 1000, 10);

> but was: <insert into ID_TABLE (id_table_id, table_name, next_id, quantity) VALUES (103, 'a', 1000, 10);
insert into ID_TABLE (id_table_id, table_name, next_id, quantity) VALUES (104, 'b', 1000, 10);
insert into ID_TABLE (id_table_id, table_name, next_id, quantity) VALUES (105, 'r_ab', 1000, 10);
insert into ID_TABLE (id_table_id, table_name, next_id, quantity) VALUES (106, 'c', 1000, 10);
insert into ID_TABLE (id_table_id, table_name, next_id, quantity) VALUES (107, 'd', 1000, 10);
insert into ID_TABLE (id_table_id, table_name, next_id, quantity) VALUES (108, 'nopk', 1000, 10);
insert into ID_TABLE (id_table_id, table_name, next_id, quantity) VALUES (109, 'MULTIPK_SELF_REFTABLE', 1000, 10);
insert into ID_TABLE (id_table_id, table_name, next_id, quantity) VALUES (110, 'ifc_table', 1000, 10);
insert into ID_TABLE (id_table_id, table_name, next_id, quantity) VALUES (111, 'ifc_table2', 1000, 10);
insert into ID_TABLE (id_table_id, table_name, next_id, quantity) VALUES (112, 'INHERITANCE_TEST', 1000, 10);
insert into ID_TABLE (id_table_id, table_name, next_id, quantity) VALUES (113, 'ext_schema', 1000, 10);
insert into ID_TABLE (id_table_id, table_name, next_id, quantity) VALUES (114, 'extext_schema', 1000, 10);
insert into ID_TABLE (id_table_id, table_name, next_id, quantity) VALUES (115, 'qualified_name', 1000, 10);

>
[ERROR]   TestProcessing.testSqlCreatedbTemplates:162->assertOutput:386 expected: <drop database if exists bookstore;
create database bookstore;
> but was: <drop database if exists bookstore;
create database bookstore;
>
[INFO]
[ERROR] Tests run: 11, Failures: 2, Errors: 0, Skipped: 0
[INFO]
[ERROR] There are test failures.

Please refer to <https://builds.apache.org/job/Torque4-trunk/org.apache.torque$torque-templates/ws/target/surefire-reports> for the individual test results.
Please refer to dump files (if any exist) [date].dump, [date]-jvmRun[N].dump and [date].dumpstream.
[JENKINS] Recording test results
[INFO]
[INFO] --- maven-jar-plugin:3.1.0:jar (default-jar) @ torque-templates ---
[INFO] Building jar: <https://builds.apache.org/job/Torque4-trunk/org.apache.torque$torque-templates/ws/target/torque-templates-4.1-SNAPSHOT.jar>
[INFO]
[INFO] --- maven-site-plugin:3.7.1:attach-descriptor (attach-descriptor) @ torque-templates ---
[INFO] Skipping because packaging 'jar' is not pom.
[INFO]
[INFO] --- apache-rat-plugin:0.12:check (default) @ torque-templates ---
[INFO] Enabled default license matchers.
[INFO] Will parse SCM ignores for exclusions...
[INFO] Finished adding exclusions from SCM ignore files.
[INFO] 61 implicit excludes (use -debug for more details).
[INFO] Exclude: velocity.log
[INFO] Exclude: .checkstyle
[INFO] Exclude: checkstyle-cache.ccf
[INFO] Exclude: derby.log
[INFO] Exclude: LICENSE-EDL.txt
[INFO] Exclude: DEPENDENCIES
[INFO] Exclude: torque-test/target/**/*
[INFO] Exclude: torque-test/.classpath
[INFO] Exclude: torque-test/.project
[INFO] Exclude: torque-test/.settings/**
[INFO] Exclude: torque-test/src/main/generated-java/**/*
[INFO] Exclude: torque-test/derby.log
[INFO] 502 resources included (use -debug for more details)
[INFO] Rat check: Summary over all files. Unapproved: 1, unknown: 1, generated: 0, approved: 499 licenses.
[CHECKSTYLE] No report found for mojo check
[PMD] No report found for mojo check

---------------------------------------------------------------------
To unsubscribe, e-mail: [hidden email]
For additional commands, e-mail: [hidden email]

Reply | Threaded
Open this post in threaded view
|

Build failed in Jenkins: Torque4-trunk » Torque Templates #636

Apache Jenkins Server-2
See <https://builds.apache.org/job/Torque4-trunk/org.apache.torque$torque-templates/636/display/redirect?page=changes>

Changes:

[gk] - fix: set eol to unix for sql (as vm generated files)

------------------------------------------
[...truncated 104.53 KB...]
2019-04-03 16:35:47,099 [main] INFO  | org.apache.torque.generator.control.Controller - Start generation of File <https://builds.apache.org/job/Torque4-trunk/org.apache.torque$torque-templates/ws/./target/generated-sources/org/apache/torque/test/manager/base/BaseAManager.java>
2019-04-03 16:35:47,101 [main] INFO  | org.apache.torque.generator.control.Controller - Start generation of File <https://builds.apache.org/job/Torque4-trunk/org.apache.torque$torque-templates/ws/./target/generated-sources/org/apache/torque/test/manager/base/BaseBManager.java>
2019-04-03 16:35:47,102 [main] INFO  | org.apache.torque.generator.control.Controller - Start generation of File <https://builds.apache.org/job/Torque4-trunk/org.apache.torque$torque-templates/ws/./target/generated-sources/org/apache/torque/test/manager/base/BaseRAbManager.java>
2019-04-03 16:35:47,104 [main] INFO  | org.apache.torque.generator.control.Controller - Start generation of File <https://builds.apache.org/job/Torque4-trunk/org.apache.torque$torque-templates/ws/./target/generated-sources/org/apache/torque/test/manager/base/BaseCManager.java>
2019-04-03 16:35:47,105 [main] INFO  | org.apache.torque.generator.control.Controller - Start generation of File <https://builds.apache.org/job/Torque4-trunk/org.apache.torque$torque-templates/ws/./target/generated-sources/org/apache/torque/test/manager/base/BaseDManager.java>
2019-04-03 16:35:47,106 [main] INFO  | org.apache.torque.generator.control.Controller - Start generation of File <https://builds.apache.org/job/Torque4-trunk/org.apache.torque$torque-templates/ws/./target/generated-sources/org/apache/torque/test/manager/base/BaseNopkManager.java>
2019-04-03 16:35:47,106 [main] INFO  | org.apache.torque.generator.control.Controller - Start generation of File <https://builds.apache.org/job/Torque4-trunk/org.apache.torque$torque-templates/ws/./target/generated-sources/org/apache/torque/test/manager/base/BaseMultipkSelfReftableManager.java>
2019-04-03 16:35:47,106 [main] INFO  | org.apache.torque.generator.control.Controller - Start generation of File <https://builds.apache.org/job/Torque4-trunk/org.apache.torque$torque-templates/ws/./target/generated-sources/org/apache/torque/test/manager/base/BaseTestInterfaceManager.java>
2019-04-03 16:35:47,107 [main] INFO  | org.apache.torque.generator.control.Controller - Start generation of File <https://builds.apache.org/job/Torque4-trunk/org.apache.torque$torque-templates/ws/./target/generated-sources/org/apache/torque/test/manager/base/BaseLocalTestInterfaceManager.java>
2019-04-03 16:35:47,107 [main] INFO  | org.apache.torque.generator.control.Controller - Start generation of File <https://builds.apache.org/job/Torque4-trunk/org.apache.torque$torque-templates/ws/./target/generated-sources/org/apache/torque/test/manager/base/BaseInheritanceTestManager.java>
2019-04-03 16:35:47,108 [main] INFO  | org.apache.torque.generator.control.Controller - Start generation of File <https://builds.apache.org/job/Torque4-trunk/org.apache.torque$torque-templates/ws/./target/generated-sources/org/apache/torque/test/manager/base/BaseExtSchemaManager.java>
2019-04-03 16:35:47,109 [main] INFO  | org.apache.torque.generator.control.Controller - Start generation of File <https://builds.apache.org/job/Torque4-trunk/org.apache.torque$torque-templates/ws/./target/generated-sources/org/apache/torque/test/manager/base/BaseExtextSchemaManager.java>
2019-04-03 16:35:47,109 [main] INFO  | org.apache.torque.generator.control.Controller - Start generation of File <https://builds.apache.org/job/Torque4-trunk/org.apache.torque$torque-templates/ws/./target/generated-sources/org/apache/torque/test/manager/base/BaseQualifiedNameManager.java>
2019-04-03 16:35:47,109 [main] INFO  | org.apache.torque.generator.control.Controller - Processing output torque.om.baseManagerForView
2019-04-03 16:35:47,109 [main] INFO  | org.apache.torque.generator.control.Controller - Processing source <https://builds.apache.org/job/Torque4-trunk/org.apache.torque$torque-templates/ws/src/test/schema/./schema.xml>
2019-04-03 16:35:47,126 [main] INFO  | org.apache.torque.generator.control.Controller - Start generation of File <https://builds.apache.org/job/Torque4-trunk/org.apache.torque$torque-templates/ws/./target/generated-sources/org/apache/torque/test/manager/base/BaseABManager.java>
[ERROR] Tests run: 9, Failures: 2, Errors: 0, Skipped: 0, Time elapsed: 9.147 s <<< FAILURE! - in org.apache.torque.templates.TestProcessing
[ERROR] testSqlCreatedbTemplates  Time elapsed: 1.444 s  <<< FAILURE!
org.opentest4j.AssertionFailedError:
expected: <drop database if exists bookstore;
create database bookstore;
> but was: <drop database if exists bookstore;
create database bookstore;
>
        at org.apache.torque.templates.TestProcessing.assertOutput(TestProcessing.java:386)
        at org.apache.torque.templates.TestProcessing.testSqlCreatedbTemplates(TestProcessing.java:162)

[ERROR] testIdtableTemplates  Time elapsed: 0.106 s  <<< FAILURE!
org.opentest4j.AssertionFailedError:
expected: <insert into ID_TABLE (id_table_id, table_name, next_id, quantity) VALUES (103, 'a', 1000, 10);
insert into ID_TABLE (id_table_id, table_name, next_id, quantity) VALUES (104, 'b', 1000, 10);
insert into ID_TABLE (id_table_id, table_name, next_id, quantity) VALUES (105, 'r_ab', 1000, 10);
insert into ID_TABLE (id_table_id, table_name, next_id, quantity) VALUES (106, 'c', 1000, 10);
insert into ID_TABLE (id_table_id, table_name, next_id, quantity) VALUES (107, 'd', 1000, 10);
insert into ID_TABLE (id_table_id, table_name, next_id, quantity) VALUES (108, 'nopk', 1000, 10);
insert into ID_TABLE (id_table_id, table_name, next_id, quantity) VALUES (109, 'MULTIPK_SELF_REFTABLE', 1000, 10);
insert into ID_TABLE (id_table_id, table_name, next_id, quantity) VALUES (110, 'ifc_table', 1000, 10);
insert into ID_TABLE (id_table_id, table_name, next_id, quantity) VALUES (111, 'ifc_table2', 1000, 10);
insert into ID_TABLE (id_table_id, table_name, next_id, quantity) VALUES (112, 'INHERITANCE_TEST', 1000, 10);
insert into ID_TABLE (id_table_id, table_name, next_id, quantity) VALUES (113, 'ext_schema', 1000, 10);
insert into ID_TABLE (id_table_id, table_name, next_id, quantity) VALUES (114, 'extext_schema', 1000, 10);
insert into ID_TABLE (id_table_id, table_name, next_id, quantity) VALUES (115, 'qualified_name', 1000, 10);

> but was: <insert into ID_TABLE (id_table_id, table_name, next_id, quantity) VALUES (103, 'a', 1000, 10);
insert into ID_TABLE (id_table_id, table_name, next_id, quantity) VALUES (104, 'b', 1000, 10);
insert into ID_TABLE (id_table_id, table_name, next_id, quantity) VALUES (105, 'r_ab', 1000, 10);
insert into ID_TABLE (id_table_id, table_name, next_id, quantity) VALUES (106, 'c', 1000, 10);
insert into ID_TABLE (id_table_id, table_name, next_id, quantity) VALUES (107, 'd', 1000, 10);
insert into ID_TABLE (id_table_id, table_name, next_id, quantity) VALUES (108, 'nopk', 1000, 10);
insert into ID_TABLE (id_table_id, table_name, next_id, quantity) VALUES (109, 'MULTIPK_SELF_REFTABLE', 1000, 10);
insert into ID_TABLE (id_table_id, table_name, next_id, quantity) VALUES (110, 'ifc_table', 1000, 10);
insert into ID_TABLE (id_table_id, table_name, next_id, quantity) VALUES (111, 'ifc_table2', 1000, 10);
insert into ID_TABLE (id_table_id, table_name, next_id, quantity) VALUES (112, 'INHERITANCE_TEST', 1000, 10);
insert into ID_TABLE (id_table_id, table_name, next_id, quantity) VALUES (113, 'ext_schema', 1000, 10);
insert into ID_TABLE (id_table_id, table_name, next_id, quantity) VALUES (114, 'extext_schema', 1000, 10);
insert into ID_TABLE (id_table_id, table_name, next_id, quantity) VALUES (115, 'qualified_name', 1000, 10);

>
        at org.apache.torque.templates.TestProcessing.assertOutput(TestProcessing.java:386)
        at org.apache.torque.templates.TestProcessing.testIdtableTemplates(TestProcessing.java:208)

[INFO] Running org.apache.torque.templates.jdbc2schema.Jdbc2SchemaTest
2019-04-03 16:35:49,553 [main] INFO  | org.apache.torque.generator.control.Controller - readConfiguration() : Starting to read configuration files
2019-04-03 16:35:49,851 [main] INFO  | org.apache.torque.generator.control.Controller - readConfiguration() : Configuration read.
2019-04-03 16:35:49,854 [main] INFO  | org.apache.torque.generator.control.Controller - Processing output jdbc2schema
2019-04-03 16:35:49,856 [main] INFO  | org.apache.torque.generator.control.Controller - Processing source JdbcMetadataSource using url jdbc:derby:memory:myDb;create=true
2019-04-03 16:35:50,325 [main] INFO  | org.apache.torque.generator.control.Controller - Start generation of File <https://builds.apache.org/job/Torque4-trunk/org.apache.torque$torque-templates/ws/target/generated-schema/schema.xml>
[INFO] Tests run: 1, Failures: 0, Errors: 0, Skipped: 0, Time elapsed: 2.712 s - in org.apache.torque.templates.jdbc2schema.Jdbc2SchemaTest
[INFO] Running org.apache.torque.templates.GenerateOmClassesFromJavaTest
2019-04-03 16:35:52,262 [main] INFO  | org.apache.torque.generator.control.Controller - readConfiguration() : Starting to read configuration files
2019-04-03 16:35:52,748 [main] INFO  | org.apache.torque.generator.control.Controller - readConfiguration() : Configuration read.
2019-04-03 16:35:52,752 [main] INFO  | org.apache.torque.generator.control.Controller - Processing output torque.om.dbObject
2019-04-03 16:35:52,755 [main] INFO  | org.apache.torque.generator.control.Controller - Processing source <https://builds.apache.org/job/Torque4-trunk/org.apache.torque$torque-templates/ws/src/test/simple-schema/./schema.xml>
2019-04-03 16:35:52,846 [main] INFO  | org.apache.torque.generator.control.Controller - Start generation of File <https://builds.apache.org/job/Torque4-trunk/org.apache.torque$torque-templates/ws/target/generateOmClassesFromJava/modifiable/org/apache/torque/templates/test/A.java>
2019-04-03 16:35:53,058 [main] INFO  | org.apache.torque.generator.control.Controller - Processing output torque.om.dbObjectForView
2019-04-03 16:35:53,059 [main] INFO  | org.apache.torque.generator.control.Controller - Processing source <https://builds.apache.org/job/Torque4-trunk/org.apache.torque$torque-templates/ws/src/test/simple-schema/./schema.xml>
2019-04-03 16:35:53,075 [main] INFO  | org.apache.torque.generator.control.Controller - No start Elements found for path all-views/view
2019-04-03 16:35:53,075 [main] INFO  | org.apache.torque.generator.control.Controller - Processing output torque.om.baseDbObject
2019-04-03 16:35:53,075 [main] INFO  | org.apache.torque.generator.control.Controller - Processing source <https://builds.apache.org/job/Torque4-trunk/org.apache.torque$torque-templates/ws/src/test/simple-schema/./schema.xml>
2019-04-03 16:35:53,091 [main] INFO  | org.apache.torque.generator.control.Controller - Start generation of File <https://builds.apache.org/job/Torque4-trunk/org.apache.torque$torque-templates/ws/target/generateOmClassesFromJava/default/org/apache/torque/templates/test/BaseA.java>
2019-04-03 16:35:53,307 [main] INFO  | org.apache.torque.generator.control.Controller - Processing output torque.om.baseDbObjectForView
2019-04-03 16:35:53,307 [main] INFO  | org.apache.torque.generator.control.Controller - Processing source <https://builds.apache.org/job/Torque4-trunk/org.apache.torque$torque-templates/ws/src/test/simple-schema/./schema.xml>
2019-04-03 16:35:53,320 [main] INFO  | org.apache.torque.generator.control.Controller - No start Elements found for path all-views/view
2019-04-03 16:35:53,320 [main] INFO  | org.apache.torque.generator.control.Controller - Processing output torque.om.inheritanceDbObject
2019-04-03 16:35:53,320 [main] INFO  | org.apache.torque.generator.control.Controller - Processing source <https://builds.apache.org/job/Torque4-trunk/org.apache.torque$torque-templates/ws/src/test/simple-schema/./schema.xml>
2019-04-03 16:35:53,330 [main] INFO  | org.apache.torque.generator.control.Controller - No start Elements found for path all-tables/table/column/inheritance
2019-04-03 16:35:53,330 [main] INFO  | org.apache.torque.generator.control.Controller - Processing output torque.om.inheritanceDbObjectForView
2019-04-03 16:35:53,331 [main] INFO  | org.apache.torque.generator.control.Controller - Processing source <https://builds.apache.org/job/Torque4-trunk/org.apache.torque$torque-templates/ws/src/test/simple-schema/./schema.xml>
2019-04-03 16:35:53,341 [main] INFO  | org.apache.torque.generator.control.Controller - No start Elements found for path all-views/view/column/inheritance
2019-04-03 16:35:53,341 [main] INFO  | org.apache.torque.generator.control.Controller - Processing output torque.om.enum
2019-04-03 16:35:53,341 [main] INFO  | org.apache.torque.generator.control.Controller - Processing source <https://builds.apache.org/job/Torque4-trunk/org.apache.torque$torque-templates/ws/src/test/simple-schema/./schema.xml>
2019-04-03 16:35:53,351 [main] INFO  | org.apache.torque.generator.control.Controller - Start generation of File <https://builds.apache.org/job/Torque4-trunk/org.apache.torque$torque-templates/ws/target/generateOmClassesFromJava/default/org/apache/torque/templates/test/AIdEnum.java>
2019-04-03 16:35:53,352 [main] INFO  | org.apache.torque.generator.control.Controller - Start generation of File <https://builds.apache.org/job/Torque4-trunk/org.apache.torque$torque-templates/ws/target/generateOmClassesFromJava/default/org/apache/torque/templates/test/NameEnum.java>
2019-04-03 16:35:53,352 [main] INFO  | org.apache.torque.generator.control.Controller - Processing output torque.om.enumForView
2019-04-03 16:35:53,352 [main] INFO  | org.apache.torque.generator.control.Controller - Processing source <https://builds.apache.org/job/Torque4-trunk/org.apache.torque$torque-templates/ws/src/test/simple-schema/./schema.xml>
2019-04-03 16:35:53,361 [main] INFO  | org.apache.torque.generator.control.Controller - No start Elements found for path all-views/view/column
2019-04-03 16:35:53,361 [main] INFO  | org.apache.torque.generator.control.Controller - Processing output torque.om.interface
2019-04-03 16:35:53,362 [main] INFO  | org.apache.torque.generator.control.Controller - Processing source <https://builds.apache.org/job/Torque4-trunk/org.apache.torque$torque-templates/ws/src/test/simple-schema/./schema.xml>
2019-04-03 16:35:53,371 [main] INFO  | org.apache.torque.generator.control.Controller - Start generation of File <https://builds.apache.org/job/Torque4-trunk/org.apache.torque$torque-templates/ws/target/generateOmClassesFromJava/modifiable/org/apache/torque/templates/test/.java>
2019-04-03 16:35:53,371 [main] INFO  | org.apache.torque.generator.control.Controller - Processing output torque.om.peerInterface
2019-04-03 16:35:53,371 [main] INFO  | org.apache.torque.generator.control.Controller - Processing source <https://builds.apache.org/job/Torque4-trunk/org.apache.torque$torque-templates/ws/src/test/simple-schema/./schema.xml>
2019-04-03 16:35:53,380 [main] INFO  | org.apache.torque.generator.control.Controller - Start generation of File <https://builds.apache.org/job/Torque4-trunk/org.apache.torque$torque-templates/ws/target/generateOmClassesFromJava/modifiable/org/apache/torque/templates/test/.java>
2019-04-03 16:35:53,380 [main] INFO  | org.apache.torque.generator.control.Controller - Processing output torque.om.peer
2019-04-03 16:35:53,380 [main] INFO  | org.apache.torque.generator.control.Controller - Processing source <https://builds.apache.org/job/Torque4-trunk/org.apache.torque$torque-templates/ws/src/test/simple-schema/./schema.xml>
2019-04-03 16:35:53,389 [main] INFO  | org.apache.torque.generator.control.Controller - Start generation of File <https://builds.apache.org/job/Torque4-trunk/org.apache.torque$torque-templates/ws/target/generateOmClassesFromJava/modifiable/org/apache/torque/templates/test/APeer.java>
2019-04-03 16:35:53,394 [main] INFO  | org.apache.torque.generator.control.Controller - Processing output torque.om.peerForView
2019-04-03 16:35:53,394 [main] INFO  | org.apache.torque.generator.control.Controller - Processing source <https://builds.apache.org/job/Torque4-trunk/org.apache.torque$torque-templates/ws/src/test/simple-schema/./schema.xml>
2019-04-03 16:35:53,403 [main] INFO  | org.apache.torque.generator.control.Controller - No start Elements found for path all-views/view
2019-04-03 16:35:53,403 [main] INFO  | org.apache.torque.generator.control.Controller - Processing output torque.om.peer.impl
2019-04-03 16:35:53,403 [main] INFO  | org.apache.torque.generator.control.Controller - Processing source <https://builds.apache.org/job/Torque4-trunk/org.apache.torque$torque-templates/ws/src/test/simple-schema/./schema.xml>
2019-04-03 16:35:53,414 [main] INFO  | org.apache.torque.generator.control.Controller - Start generation of File <https://builds.apache.org/job/Torque4-trunk/org.apache.torque$torque-templates/ws/target/generateOmClassesFromJava/modifiable/org/apache/torque/templates/test/APeerImpl.java>
2019-04-03 16:35:53,421 [main] INFO  | org.apache.torque.generator.control.Controller - Processing output torque.om.peerForView.impl
2019-04-03 16:35:53,421 [main] INFO  | org.apache.torque.generator.control.Controller - Processing source <https://builds.apache.org/job/Torque4-trunk/org.apache.torque$torque-templates/ws/src/test/simple-schema/./schema.xml>
2019-04-03 16:35:53,431 [main] INFO  | org.apache.torque.generator.control.Controller - No start Elements found for path all-views/view
2019-04-03 16:35:53,432 [main] INFO  | org.apache.torque.generator.control.Controller - Processing output torque.om.basePeer
2019-04-03 16:35:53,432 [main] INFO  | org.apache.torque.generator.control.Controller - Processing source <https://builds.apache.org/job/Torque4-trunk/org.apache.torque$torque-templates/ws/src/test/simple-schema/./schema.xml>
2019-04-03 16:35:53,442 [main] INFO  | org.apache.torque.generator.control.Controller - Start generation of File <https://builds.apache.org/job/Torque4-trunk/org.apache.torque$torque-templates/ws/target/generateOmClassesFromJava/default/org/apache/torque/templates/test/BaseAPeer.java>
2019-04-03 16:35:53,546 [main] INFO  | org.apache.torque.generator.control.Controller - Processing output torque.om.basePeerForView
2019-04-03 16:35:53,547 [main] INFO  | org.apache.torque.generator.control.Controller - Processing source <https://builds.apache.org/job/Torque4-trunk/org.apache.torque$torque-templates/ws/src/test/simple-schema/./schema.xml>
2019-04-03 16:35:53,558 [main] INFO  | org.apache.torque.generator.control.Controller - No start Elements found for path all-views/view
2019-04-03 16:35:53,558 [main] INFO  | org.apache.torque.generator.control.Controller - Processing output torque.om.basePeer.impl
2019-04-03 16:35:53,558 [main] INFO  | org.apache.torque.generator.control.Controller - Processing source <https://builds.apache.org/job/Torque4-trunk/org.apache.torque$torque-templates/ws/src/test/simple-schema/./schema.xml>
2019-04-03 16:35:53,568 [main] INFO  | org.apache.torque.generator.control.Controller - Start generation of File <https://builds.apache.org/job/Torque4-trunk/org.apache.torque$torque-templates/ws/target/generateOmClassesFromJava/default/org/apache/torque/templates/test/BaseAPeerImpl.java>
2019-04-03 16:35:53,615 [main] INFO  | org.apache.torque.generator.control.Controller - Processing output torque.om.basePeerForView.impl
2019-04-03 16:35:53,616 [main] INFO  | org.apache.torque.generator.control.Controller - Processing source <https://builds.apache.org/job/Torque4-trunk/org.apache.torque$torque-templates/ws/src/test/simple-schema/./schema.xml>
2019-04-03 16:35:53,624 [main] INFO  | org.apache.torque.generator.control.Controller - No start Elements found for path all-views/view
2019-04-03 16:35:53,624 [main] INFO  | org.apache.torque.generator.control.Controller - Processing output torque.om.recordMapper
2019-04-03 16:35:53,624 [main] INFO  | org.apache.torque.generator.control.Controller - Processing source <https://builds.apache.org/job/Torque4-trunk/org.apache.torque$torque-templates/ws/src/test/simple-schema/./schema.xml>
2019-04-03 16:35:53,632 [main] INFO  | org.apache.torque.generator.control.Controller - Start generation of File <https://builds.apache.org/job/Torque4-trunk/org.apache.torque$torque-templates/ws/target/generateOmClassesFromJava/modifiable/org/apache/torque/templates/test/ARecordMapper.java>
2019-04-03 16:35:53,635 [main] INFO  | org.apache.torque.generator.control.Controller - Processing output torque.om.recordMapperForView
2019-04-03 16:35:53,635 [main] INFO  | org.apache.torque.generator.control.Controller - Processing source <https://builds.apache.org/job/Torque4-trunk/org.apache.torque$torque-templates/ws/src/test/simple-schema/./schema.xml>
2019-04-03 16:35:53,643 [main] INFO  | org.apache.torque.generator.control.Controller - No start Elements found for path all-views/view
2019-04-03 16:35:53,643 [main] INFO  | org.apache.torque.generator.control.Controller - Processing output torque.om.baseRecordMapper
2019-04-03 16:35:53,643 [main] INFO  | org.apache.torque.generator.control.Controller - Processing source <https://builds.apache.org/job/Torque4-trunk/org.apache.torque$torque-templates/ws/src/test/simple-schema/./schema.xml>
2019-04-03 16:35:53,650 [main] INFO  | org.apache.torque.generator.control.Controller - Start generation of File <https://builds.apache.org/job/Torque4-trunk/org.apache.torque$torque-templates/ws/target/generateOmClassesFromJava/default/org/apache/torque/templates/test/BaseARecordMapper.java>
2019-04-03 16:35:53,658 [main] INFO  | org.apache.torque.generator.control.Controller - Processing output torque.om.baseRecordMapperForView
2019-04-03 16:35:53,658 [main] INFO  | org.apache.torque.generator.control.Controller - Processing source <https://builds.apache.org/job/Torque4-trunk/org.apache.torque$torque-templates/ws/src/test/simple-schema/./schema.xml>
2019-04-03 16:35:53,665 [main] INFO  | org.apache.torque.generator.control.Controller - No start Elements found for path all-views/view
2019-04-03 16:35:53,665 [main] INFO  | org.apache.torque.generator.control.Controller - Processing output torque.om.bean
2019-04-03 16:35:53,665 [main] INFO  | org.apache.torque.generator.control.Controller - Processing source <https://builds.apache.org/job/Torque4-trunk/org.apache.torque$torque-templates/ws/src/test/simple-schema/./schema.xml>
2019-04-03 16:35:53,672 [main] INFO  | org.apache.torque.generator.control.Controller - Start generation of File <https://builds.apache.org/job/Torque4-trunk/org.apache.torque$torque-templates/ws/target/generateOmClassesFromJava/modifiable/org/apache/torque/templates/test/bean/ABean.java>
2019-04-03 16:35:53,672 [main] INFO  | org.apache.torque.generator.control.Controller - Processing output torque.om.beanForView
2019-04-03 16:35:53,673 [main] INFO  | org.apache.torque.generator.control.Controller - Processing source <https://builds.apache.org/job/Torque4-trunk/org.apache.torque$torque-templates/ws/src/test/simple-schema/./schema.xml>
2019-04-03 16:35:53,679 [main] INFO  | org.apache.torque.generator.control.Controller - No start Elements found for path all-views/view
2019-04-03 16:35:53,679 [main] INFO  | org.apache.torque.generator.control.Controller - Processing output torque.om.baseBean
2019-04-03 16:35:53,679 [main] INFO  | org.apache.torque.generator.control.Controller - Processing source <https://builds.apache.org/job/Torque4-trunk/org.apache.torque$torque-templates/ws/src/test/simple-schema/./schema.xml>
2019-04-03 16:35:53,686 [main] INFO  | org.apache.torque.generator.control.Controller - Start generation of File <https://builds.apache.org/job/Torque4-trunk/org.apache.torque$torque-templates/ws/target/generateOmClassesFromJava/default/org/apache/torque/templates/test/bean/BaseABean.java>
2019-04-03 16:35:53,686 [main] INFO  | org.apache.torque.generator.control.Controller - Processing output torque.om.baseBeanForView
2019-04-03 16:35:53,686 [main] INFO  | org.apache.torque.generator.control.Controller - Processing source <https://builds.apache.org/job/Torque4-trunk/org.apache.torque$torque-templates/ws/src/test/simple-schema/./schema.xml>
2019-04-03 16:35:53,692 [main] INFO  | org.apache.torque.generator.control.Controller - No start Elements found for path all-views/view
2019-04-03 16:35:53,692 [main] INFO  | org.apache.torque.generator.control.Controller - Processing output torque.om.inheritanceBean
2019-04-03 16:35:53,693 [main] INFO  | org.apache.torque.generator.control.Controller - Processing source <https://builds.apache.org/job/Torque4-trunk/org.apache.torque$torque-templates/ws/src/test/simple-schema/./schema.xml>
2019-04-03 16:35:53,699 [main] INFO  | org.apache.torque.generator.control.Controller - No start Elements found for path all-tables/table/column/inheritance
2019-04-03 16:35:53,699 [main] INFO  | org.apache.torque.generator.control.Controller - Processing output torque.om.inheritanceBeanForView
2019-04-03 16:35:53,699 [main] INFO  | org.apache.torque.generator.control.Controller - Processing source <https://builds.apache.org/job/Torque4-trunk/org.apache.torque$torque-templates/ws/src/test/simple-schema/./schema.xml>
2019-04-03 16:35:53,706 [main] INFO  | org.apache.torque.generator.control.Controller - No start Elements found for path all-views/view/column/inheritance
2019-04-03 16:35:53,706 [main] INFO  | org.apache.torque.generator.control.Controller - Processing output torque.om.mapInit
2019-04-03 16:35:53,707 [main] INFO  | org.apache.torque.generator.control.Controller - Processing source src/test/simple-schema/./schema.xml
2019-04-03 16:35:53,714 [main] INFO  | org.apache.torque.generator.control.Controller - Start generation of File <https://builds.apache.org/job/Torque4-trunk/org.apache.torque$torque-templates/ws/target/generateOmClassesFromJava/modifiable/org/apache/torque/linkage/BookstoreDatabaseMapInit.java>
2019-04-03 16:35:53,715 [main] INFO  | org.apache.torque.generator.control.Controller - Processing output torque.om.baseMapInit
2019-04-03 16:35:53,715 [main] INFO  | org.apache.torque.generator.control.Controller - Processing source src/test/simple-schema/./schema.xml
2019-04-03 16:35:53,721 [main] INFO  | org.apache.torque.generator.control.Controller - Start generation of File <https://builds.apache.org/job/Torque4-trunk/org.apache.torque$torque-templates/ws/target/generateOmClassesFromJava/default/org/apache/torque/templates/test/BaseBookstoreDatabaseMapInit.java>
2019-04-03 16:35:53,721 [main] INFO  | org.apache.torque.generator.control.Controller - Processing output torque.om.manager
2019-04-03 16:35:53,722 [main] INFO  | org.apache.torque.generator.control.Controller - Processing source <https://builds.apache.org/job/Torque4-trunk/org.apache.torque$torque-templates/ws/src/test/simple-schema/./schema.xml>
2019-04-03 16:35:53,728 [main] INFO  | org.apache.torque.generator.control.Controller - Start generation of File <https://builds.apache.org/job/Torque4-trunk/org.apache.torque$torque-templates/ws/target/generateOmClassesFromJava/modifiable/org/apache/torque/templates/test/manager/AManager.java>
2019-04-03 16:35:53,728 [main] INFO  | org.apache.torque.generator.control.Controller - Processing output torque.om.managerForView
2019-04-03 16:35:53,728 [main] INFO  | org.apache.torque.generator.control.Controller - Processing source <https://builds.apache.org/job/Torque4-trunk/org.apache.torque$torque-templates/ws/src/test/simple-schema/./schema.xml>
2019-04-03 16:35:53,736 [main] INFO  | org.apache.torque.generator.control.Controller - No start Elements found for path all-views/view
2019-04-03 16:35:53,736 [main] INFO  | org.apache.torque.generator.control.Controller - Processing output torque.om.baseManager
2019-04-03 16:35:53,736 [main] INFO  | org.apache.torque.generator.control.Controller - Processing source <https://builds.apache.org/job/Torque4-trunk/org.apache.torque$torque-templates/ws/src/test/simple-schema/./schema.xml>
2019-04-03 16:35:53,746 [main] INFO  | org.apache.torque.generator.control.Controller - Start generation of File <https://builds.apache.org/job/Torque4-trunk/org.apache.torque$torque-templates/ws/target/generateOmClassesFromJava/default/org/apache/torque/templates/test/manager/base/BaseAManager.java>
2019-04-03 16:35:53,746 [main] INFO  | org.apache.torque.generator.control.Controller - Processing output torque.om.baseManagerForView
2019-04-03 16:35:53,747 [main] INFO  | org.apache.torque.generator.control.Controller - Processing source <https://builds.apache.org/job/Torque4-trunk/org.apache.torque$torque-templates/ws/src/test/simple-schema/./schema.xml>
2019-04-03 16:35:53,755 [main] INFO  | org.apache.torque.generator.control.Controller - No start Elements found for path all-views/view
[INFO] Tests run: 1, Failures: 0, Errors: 0, Skipped: 0, Time elapsed: 2.208 s - in org.apache.torque.templates.GenerateOmClassesFromJavaTest
[INFO]
[INFO] Results:
[INFO]
[ERROR] Failures:
[ERROR]   TestProcessing.testIdtableTemplates:208->assertOutput:386 expected: <insert into ID_TABLE (id_table_id, table_name, next_id, quantity) VALUES (103, 'a', 1000, 10);
insert into ID_TABLE (id_table_id, table_name, next_id, quantity) VALUES (104, 'b', 1000, 10);
insert into ID_TABLE (id_table_id, table_name, next_id, quantity) VALUES (105, 'r_ab', 1000, 10);
insert into ID_TABLE (id_table_id, table_name, next_id, quantity) VALUES (106, 'c', 1000, 10);
insert into ID_TABLE (id_table_id, table_name, next_id, quantity) VALUES (107, 'd', 1000, 10);
insert into ID_TABLE (id_table_id, table_name, next_id, quantity) VALUES (108, 'nopk', 1000, 10);
insert into ID_TABLE (id_table_id, table_name, next_id, quantity) VALUES (109, 'MULTIPK_SELF_REFTABLE', 1000, 10);
insert into ID_TABLE (id_table_id, table_name, next_id, quantity) VALUES (110, 'ifc_table', 1000, 10);
insert into ID_TABLE (id_table_id, table_name, next_id, quantity) VALUES (111, 'ifc_table2', 1000, 10);
insert into ID_TABLE (id_table_id, table_name, next_id, quantity) VALUES (112, 'INHERITANCE_TEST', 1000, 10);
insert into ID_TABLE (id_table_id, table_name, next_id, quantity) VALUES (113, 'ext_schema', 1000, 10);
insert into ID_TABLE (id_table_id, table_name, next_id, quantity) VALUES (114, 'extext_schema', 1000, 10);
insert into ID_TABLE (id_table_id, table_name, next_id, quantity) VALUES (115, 'qualified_name', 1000, 10);

> but was: <insert into ID_TABLE (id_table_id, table_name, next_id, quantity) VALUES (103, 'a', 1000, 10);
insert into ID_TABLE (id_table_id, table_name, next_id, quantity) VALUES (104, 'b', 1000, 10);
insert into ID_TABLE (id_table_id, table_name, next_id, quantity) VALUES (105, 'r_ab', 1000, 10);
insert into ID_TABLE (id_table_id, table_name, next_id, quantity) VALUES (106, 'c', 1000, 10);
insert into ID_TABLE (id_table_id, table_name, next_id, quantity) VALUES (107, 'd', 1000, 10);
insert into ID_TABLE (id_table_id, table_name, next_id, quantity) VALUES (108, 'nopk', 1000, 10);
insert into ID_TABLE (id_table_id, table_name, next_id, quantity) VALUES (109, 'MULTIPK_SELF_REFTABLE', 1000, 10);
insert into ID_TABLE (id_table_id, table_name, next_id, quantity) VALUES (110, 'ifc_table', 1000, 10);
insert into ID_TABLE (id_table_id, table_name, next_id, quantity) VALUES (111, 'ifc_table2', 1000, 10);
insert into ID_TABLE (id_table_id, table_name, next_id, quantity) VALUES (112, 'INHERITANCE_TEST', 1000, 10);
insert into ID_TABLE (id_table_id, table_name, next_id, quantity) VALUES (113, 'ext_schema', 1000, 10);
insert into ID_TABLE (id_table_id, table_name, next_id, quantity) VALUES (114, 'extext_schema', 1000, 10);
insert into ID_TABLE (id_table_id, table_name, next_id, quantity) VALUES (115, 'qualified_name', 1000, 10);

>
[ERROR]   TestProcessing.testSqlCreatedbTemplates:162->assertOutput:386 expected: <drop database if exists bookstore;
create database bookstore;
> but was: <drop database if exists bookstore;
create database bookstore;
>
[INFO]
[ERROR] Tests run: 11, Failures: 2, Errors: 0, Skipped: 0
[INFO]
[ERROR] There are test failures.

Please refer to <https://builds.apache.org/job/Torque4-trunk/org.apache.torque$torque-templates/ws/target/surefire-reports> for the individual test results.
Please refer to dump files (if any exist) [date].dump, [date]-jvmRun[N].dump and [date].dumpstream.
[JENKINS] Recording test results
[INFO]
[INFO] --- maven-jar-plugin:3.1.0:jar (default-jar) @ torque-templates ---
[INFO] Building jar: <https://builds.apache.org/job/Torque4-trunk/org.apache.torque$torque-templates/ws/target/torque-templates-4.1-SNAPSHOT.jar>
[INFO]
[INFO] --- maven-site-plugin:3.7.1:attach-descriptor (attach-descriptor) @ torque-templates ---
[INFO] Skipping because packaging 'jar' is not pom.
[INFO]
[INFO] --- apache-rat-plugin:0.12:check (default) @ torque-templates ---
[INFO] Enabled default license matchers.
[INFO] Will parse SCM ignores for exclusions...
[INFO] Finished adding exclusions from SCM ignore files.
[INFO] 61 implicit excludes (use -debug for more details).
[INFO] Exclude: velocity.log
[INFO] Exclude: .checkstyle
[INFO] Exclude: checkstyle-cache.ccf
[INFO] Exclude: derby.log
[INFO] Exclude: LICENSE-EDL.txt
[INFO] Exclude: DEPENDENCIES
[INFO] Exclude: torque-test/target/**/*
[INFO] Exclude: torque-test/.classpath
[INFO] Exclude: torque-test/.project
[INFO] Exclude: torque-test/.settings/**
[INFO] Exclude: torque-test/src/main/generated-java/**/*
[INFO] Exclude: torque-test/derby.log
[INFO] 502 resources included (use -debug for more details)
[INFO] Rat check: Summary over all files. Unapproved: 1, unknown: 1, generated: 0, approved: 499 licenses.
[CHECKSTYLE] No report found for mojo check
[PMD] No report found for mojo check

---------------------------------------------------------------------
To unsubscribe, e-mail: [hidden email]
For additional commands, e-mail: [hidden email]

Reply | Threaded
Open this post in threaded view
|

Jenkins build is back to normal : Torque4-trunk » Torque Templates #637

Apache Jenkins Server-2
See <https://builds.apache.org/job/Torque4-trunk/org.apache.torque$torque-templates/637/display/redirect?page=changes>


---------------------------------------------------------------------
To unsubscribe, e-mail: [hidden email]
For additional commands, e-mail: [hidden email]